Changes

6,090 bytes added ,  16:31, 16 September 2021
no edit summary
! Value || Name
|-
| 1 || KernelSvc
|-
| 2 || FSFs
|-
| 3 || OS (Memory, Thread, Mutex, NVIDIA)Os
|-
| 4 || Htcs
|-
| 5 || NCMNcm
|-
| 6 || DDDd
|-
| 7 || Debug MonitorOsdbg
|-
| 8 || LRLr
|-
| 9 || LoaderLdr
|-
| 10 || CMIF (IPC command interface)Sf
|-
| 11 || HIPC (IPC)Sf_Hipc
|-
| 15 12 || PMTma
|-
| 13 || |-| 14 || |-| 15 || Pm|-| 16 || NSNs
|-
| 17 || Bsdsockets
| 18 || Htc
|-
| 19 || TSCTsc
|-
| 20 || NCM (content)Kvdb
|-
| 21 || SMSm
|-
| 22 || RO (userland)Ro
|-
| 23 || GCGc
|-
| 24 || SDMMCSdmmc
|-
| 25 || OVLNOvln
|-
| 26 || SPLSpl
|-
| 27 || Socket
|-
| 28 ||
|-
| 29 || Htclow
|-
| 30 || BusDdsf
|-
| 31 || Htcfs
| 32 || Async
|-
| 33 || Util|-| 34 || |-| 35 || Tipc|-| 100 || ETHCEth
|-
| 101 || I2CI2c
|-
| 102 || GPIOGpio
|-
| 103 || UARTUart|-| 104 ||
|-
| 105 || Settings
|-
| 107 106 || WLAN
|-
| 108 107 || XCDWlan
|-
| 110 108 || NIFMXcd
|-
| 111 109 || Hwopus
|-
| 110 || Nifm|-| 111 || Codec|-| 112 || SasbusLsm6ds3
|-
| 113 || Bluetooth
|-
| 114 || VIVi
|-
| 115 || NFPNfp
|-
| 116 || Time
|-
| 117 || FGMFgm|-| 118 || Oe
|-
| 118 119 || OE
|-
| 120 || PCIePcie
|-
| 121 || Friends
|-
| 122 || BCATBcat
|-
| 123 || SSLSsl
|-
| 124 || Account
| 126 || Mii
|-
| 127 || NFCNfc
|-
| 128 || AMAm
|-
| 129 || Play ReportPrepo
|-
| 130 || AHIDAhid
|-
| 132 131 || Home Menu (Qlaunch)Applet
|-
| 133 132 || PCVAe
|-
| 134 133 || OMMPcv
|-
| 135 134 || BPCUsb_Pd
|-
| 136 135 || PSMBpc
|-
| 137 136 || NIMPsm
|-
| 138 137 || PSCNim
|-
| 139 138 || TCPsc
|-
| 140 139 || USBTc
|-
| 141 140 || NSDUsb
|-
| 142 141 || PCTLNsd
|-
| 143 142 || BTMPctl
|-
| 144 143 || LA (Library Applet)Btm
|-
| 145 144 || ETicketLa
|-
| 146 145 || NGC (Bad Words)Es
|-
| 147 146 || Error ReportNgc
|-
| 148 147 || APMErpt
|-
| 148 || Apm|-| 149 || CECCec
|-
| 150 || Profiler
|-
| 151 || Error UploadEupld|-| 152 || Lidbe
|-
| 153 || Audio
|-
| 154 || NPNSNpns
|-
| 155 || NPNS XMPP StreamHttp
|-
| 156 || Idle|-| 157 || ARPArp
|-
| 158 || Updater
|-
| 159 || SWKBDSwkbd
|-
| 161 160 || MifareNetdiag
|-
| 161 || Nfc_Mifare|-| 162 || Userland (assert)Err
|-
| 163 || Fatal
|-
| 164 || EC (Shop)Ec
|-
| 165 || SPSMSpsm
|-
| 167 166 || BGTCAoc
|-
| 168 167 || Userland (crash)Bgtc
|-
| 169 168 || Sasbus Periodic Receive ModeCreport
|-
| 175 169 || JITSasbus
|-
| 178 170 || PDMPl
|-
| 179 171 || OLSC
|-
| 180 172 || SREPO
|-
| 181 173 || DauthLbl
|-
| 187 174 || Sasbus
|-
| 189 175 || PWMJit
|-
| 191 176 || RTCHdcp
|-
| 192 177 || RegulatorOmm
|-
| 193 178 || LedPdm
|-
| 197 179 || ClkrstOlsc
|-
| 202 180 || HIDSrepo
|-
| 203 181 || LDNDauth
|-
| 205 182 || IrsensorStdfu
|-
| 206 183 || CaptureDbg
|-
| 208 184 || Manu
|-
| 209 185 || ATK
|-
| 210 186 || Web
|-
| 211 187 || LCS (Local Content Sharing)Spi
|-
| 212 188 || GRC
|-
| 214 189 || AlbumPwm
|-
| 216 190 || Migration
|-
| 217 191 || Migration Idc ServerRtc
|-
| 218 192 || HidbusRegulator
|-
| 223 193 || WebsocketLed
|-
| 228 194 || PGL
|-
| 229 195 || Notification
|-
| 230 196 || Ins
|-
| 231 197 || Lp2p|} == Error codes =={| class=wikitable! Value || Module || Description || NotesClkrst
|-
| 0x0E01 198 || 1 || 7 || Session count exceededPowctl
|-
| 0x1C01 199 || 1 || 14 || Invalid kernel capability descriptor
|-
| 0x4201 200 || 1 || 33 || Not Implemented
|-
| 0x7601 201 || 1 || 59 || Thread terminated/termination requested
|-
| 0x8C01 202 || 1 || 70 || No more debug eventsHid
|-
| 0xCA01 203 || 1 || 101 || Invalid sizeLdn
|-
| 0xCC01 204 || 1 || 102 || Invalid addressCs
|-
| 0xCE01 205 || 1 || 103 || Resource exhaustionIrsensor
|-
| 0xD001 206 || 1 || 104 || Memory exhaustionCapsrv
|-
| 0xD201 207 || 1 || 105 || Handle-table exhaustion
|-
| 0xD401 208 || 1 || 106 || Invalid memory state / invalid memory permissions.Manu
|-
| 0xD801 209 || 1 || 108 || Invalid memory permissions.Atk
|-
| 0xDC01 210 || 1 || 110 || Invalid memory rangeWeb
|-
| 0xE001 211 || 1 || 112 || Invalid thread priority.Lcs
|-
| 0xE201 212 || 1 || 113 || Invalid processor id.Grc
|-
| 0xE401 213 || 1 || 114 || Invalid handle.Repair
|-
| 0xE601 214 || 1 || 115 || Invalid pointer/Syscall copy from user failed.Album
|-
| 0xE801 215 || 1 || 116 || Invalid combinationRid
|-
| 0xEA01 216 || 1 || 117 || Time out. Also when you give 0 handles to svcWaitSynchronizationN.Migration
|-
| 0xEC01 217 || 1 || 118 || Operation canceledMigration_Idc
|-
| 0xEE01 218 || 1 || 119 || Out of rangeHidbus
|-
| 0xF001 219 || 1 || 120 || Invalid enumEns
|-
| 0xF201 220 || 1 || 121 || No such entry
|-
| 0xF401 221 || 1 || 122 || Irq/DeviceAddressSpace/{...} already registered
|-
| 0xF601 222 || 1 || 123 || Port remote dead
|-
| 0xF801 223 || 1 || 124 || [Usermode] Unhandled interrupt/exceptionWebsocket
|-
| 0xFA01 224 || 1 || 125 || Invalid state
|-
| 0xFC01 225 || 1 || 126 || Reserved value
|-
| 0xFE01 226 || 1 || 127 || Invalid hardware breakpoint
|-
| 0x10001 227 || 1 || 128 || [Usermode] Fatal exceptionCapmtp
|-
| 0x10201 228 || 1 || 129 || Last thread didn't belong to your processPgl
|-
| 0x10601 229 || 1 || 131 || Port closedNotification
|-
| 0x10801 230 || 1 || 132 || Resource limit exceededIns
|-
| 0x20801 231 || 1 || 260 || Command buffer too smallLp2p
|-
| 0x40A01 232 || 1 || 517 || Invalid process ID.Rcd
|-
| 0x40C01 233 || 1 || 518 || Invalid thread ID.
|-
| 0x40E01 234 || 1 || 519 || Invalid thread ID (used in svcGetDebugThreadParam).
|-
| 0x41001 235 || 1 || 520 || Process not being debuggedPrc
|-
| 0x202 236 || 2 || 1 || Path does not exist.
|-
| 0x402 237 || 2 || 2 || Path already exists.
|-
| 0xE02 238 || 2 || 7 || Resource already in use (file already opened, savedata filesystem already mounted).Ectx
|-
| 0x4602 239 || 2 || 35 || Not enough free space for BIS Calibration partition.Mnpp
|-
| 0x4802 240 || 2 || 36 || Not enough free space for BIS Safe partition.
|-
| 0x4A02 241 || 2 || 37 || Not enough free space for BIS User partition.
|-
| 0x4C02 242 || 2 || 38 || Not enough free space for BIS System partition.
|-
| 0x4E02 243 || 2 || 39 || Not enough free space on SD card.
|-
| 0x6402 244 || 2 || 50 || NCA is older than version 3, or NCA SDK version is older than 0.11.0.0Dp2hdmi
|-
| 0x7802 245 || 2 || 60 || Specified mount name already exists.
|-
| 0x7D202 246 || 2 || 1001 || Process does not have RomFs Sprofile
|-
| 0x7D402 247 || 2 || 1002 || Title-id not found / savedata not found.
|-
| 0xFA202 248 || 2 || 2001 || SD card not inserted
|-
| 0x13B002 249 || 2 || 2520 || Gamecard not inserted
|-
| 0x13B402 250 || 2 || 2522 || Attempted process an AsicHandler command in initial modeNdrm
|-
| 0x13D802 300 || 2 || 2540 || Attempted to read from the secure gamecard partition in normal mode
|-
| 0x13DA02 301 || 2 || 2541 || Attempted to read from the normal gamecard partition in secure mode
|-
| 0x13DC02 302 || 2 || 2542 || Attempted a read that spanned both the normal and secure gamecard partitions
|-
| 0x13E002 303 || 2 || 2544 || Gamecard initial data hash doesn't match the initial data hash in the card header
|-
| 0x13E202 304 || 2 || 2545 || Gamecard initial data reserved area is not all zeros
|-
| 0x13E402 305 || 2 || 2546 || Gamecard certificate kek index doesn't match card header kek index
|-
| 0x13EE02 306 || 2 || 2551 || Unable to read card header on gamecard init
|-
| 0x140A02 307 || 2 || 2565 || Encountered SDMMC error in write operation
|-
| 0x145002 308 || 2 || 2600 || Attempted to switch lotus state machine to secure mode from a mode other than normal
|-
| 0x145202 309 || 2 || 2601 || Attempted to switch lotus state machine to normal mode from a mode other than initial
|-
| 0x145402 310 || 2 || 2602 || Attempted to switch lotus state machine to write mode from a mode other than normal
|-
| 0x149402 311 || 2 || 2634 || Error processing lotus command SetUserAsicFirmware
|-
| 0x149A02 312 || 2 || 2637 || Error processing lotus command GetAsicCert
|-
| 0x14A002 313 || 2 || 2640 || Error processing lotus command SetEmmcEmbeddedSocCertificate
|-
| 0x14AA02 314 || 2 || 2645 || Error processing lotus command GetAsicEncryptedMessage
|-
| 0x14AC02 315 || 2 || 2646 || Error processing lotus command SetLibraryEncryptedMessage
|-
| 0x14B602 316 || 2 || 2651 || Error processing lotus command GetAsicAuthenticationData
|-
| 0x14B802 317 || 2 || 2652 || Error processing lotus command SetAsicAuthenticationDataHash
|-
| 0x14BA02 318 || 2 || 2653 || Error processing lotus command SetLibraryAuthenticationData
|-
| 0x14BC02 319 || 2 || 2654 || Error processing lotus command GetLibraryAuthenticationDataHash
|-
| 0x14C202 320 || 2 || 2657 || Error processing lotus command ExchangeRandomValuesInSecureMode
|-
| 0x14D802 321 || 2 || 2668 || Error calling nn::gc::detail::GcCrypto::GenerateRandomBytes
|-
| 0x14DE02 499 || 2 Tspm|} == Error codes =={| class=wikitable! Value || Module | 2671 |Description | Error processing lotus command ReadAsicRegister| Notes
|-
| 0x14E002 0x0E01 || 2 1 || 2672 7 || Error processing lotus command GetGameCardIdSetSession count exceeded
|-
| 0x14E402 0x1C01 || 2 1 || 2674 14 || Error processing lotus command GetCardHeaderInvalid kernel capability descriptor
|-
| 0x14E802 0x4201 || 2 1 || 2676 33 || Error processing lotus command GetCardKeyAreaNot Implemented
|-
| 0x14EA02 0x7601 || 2 1 || 2677 59 || Error processing lotus command ChangeDebugModeThread terminated/termination requested
|-
| 0x14EC02 0x8C01 || 2 1 || 2678 70 || Error processing lotus command GetRmaInformationNo more debug events
|-
| 0x150802 0xCA01 || 2 1 || 2692 101 || Tried sending lotus card command Refresh when not in secure modeInvalid size
|-
| 0x150A02 0xCC01 || 2 1 || 2693 102 || Tried sending lotus card command when not in correct modeInvalid address
|-
| 0x155602 0xCE01 || 2 1 || 2731 103 || Error processing lotus card command ReadId1Resource exhaustion
|-
| 0x155802 0xD001 || 2 1 || 2732 104 || Error processing lotus card command ReadId2Memory exhaustion
|-
| 0x155A02 0xD201 || 2 1 || 2733 105 || Error processing lotus card command ReadId3Handle-table exhaustion
|-
| 0x155E02 0xD401 || 2 1 || 2735 106 || Error processing lotus card command ReadPageInvalid memory state / invalid memory permissions.
|-
| 0x156202 0xD801 || 2 1 || 2737 108 || Error processing lotus card command WritePageInvalid memory permissions.
|-
| 0x156402 0xDC01 || 2 1 || 2738 110 || Error processing lotus card command RefreshInvalid memory range
|-
| 0x156C02 0xE001 || 2 1 || 2742 112 || Error processing lotus card command ReadCrcInvalid thread priority.
|-
| 0x156E02 0xE201 || 2 1 || 2743 113 || Error processing lotus card command Erase or UnlockForceEraseInvalid processor id.
|-
| 0x157002 0xE401 || 2 1 || 2744 114 || Error processing lotus card command ReadDevParamInvalid handle.
|-
| 0x157202 0xE601 || 2 1 || 2745 115 || Error processing lotus card command WriteDevParamInvalid pointer/Syscall copy from user failed.
|-
| 0x16B002 0xE801 || 2 1 || 2904 116 || Id2Normal did not match the value in the buffer returned by ChangeDebugModeInvalid combination
|-
| 0x16B202 0xEA01 || 2 1 || 2905 117 || Id1Normal did not match Id1Writer Time out. Also when switching gamecard you give 0 handles to write modesvcWaitSynchronizationN.
|-
| 0x16B402 0xEC01 || 2 1 || 2906 118 || Id2Normal did not match Id2Writer when switching gamecard to write modeOperation canceled
|-
| 0x171402 0xEE01 || 2 1 || 2954 119 || Invalid gamecard handle.Out of range
|-
| 0x172002 0xF001 || 2 1 || 2960 120 || Invalid gamecard handle when opening normal gamecard partitionenum
|-
| 0x172202 0xF201 || 2 1 || 2961 121 || Invalid gamecard handle when opening secure gamecard partitionNo such entry
|-
| 0x177202 0xF401 || 2 1 || 3001 122 || Unimplemented behaviorIrq/DeviceAddressSpace/{...} already registered
|-
| 0x177602 0xF601 || 2 1 || 3003 123 || File/Directory already exists.Port remote dead
|-
| 0x190202 0xF801 || 2 1 || 3201 124 || Memory allocation failure related to FAT filesystem code[Usermode] Unhandled interrupt/exception
|-
| 0x190602 0xFA01 || 2 1 || 3203 125 || Memory allocation failure related to FAT filesystem codeInvalid state
|-
| 0x190802 0xFC01 || 2 1 || 3204 126 || Memory allocation failure related to FAT filesystem codeReserved value
|-
| 0x190A02 0xFE01 || 2 1 || 3205 127 || Memory allocation failure related to FAT filesystem codeInvalid hardware breakpoint
|-
| 0x190C02 0x10001 || 2 1 || 3206 128 || Memory allocation failure related to FAT filesystem code[Usermode] Fatal exception
|-
| 0x191002 0x10201 || 2 1 || 3208 129 || Memory allocation failure related Last thread didn't belong to FAT filesystem codeyour process
|-
| 0x195802 0x10601 || 2 1 || 3244 131 || Allocation failure related to SD cardsPort closed
|-
| 0x196002 0x10801 || 2 1 || 3248 132 || Out of memoryResource limit exceeded
|-
| 0x196202 0x20801 || 2 1 || 3249 260 || Out of memoryCommand buffer too small
|-
| 0x1A3E02 0x40A01 || 2 1 || 3359 517 || Out of memoryInvalid process ID.
|-
| 0x1A4002 0x40C01 || 2 1 || 3360 518 || Out of memoryInvalid thread ID.
|-
| 0x1A4A02 0x40E01 || 2 1 || 3365 519 || Out of memoryInvalid thread ID (used in svcGetDebugThreadParam).
|-
| 0x21BC02 0x41001 || 2 1 || 4318 520 || Invalid save data filesystem magic (valid magic is SAVE in ASCII)Process not being debugged
|-
| 0x234202 0x202 || 2 || 4513 1 || Error reading ACID section in NPDMPath does not exist.
|-
| 0x234402 0x402 || 2 || 4514 2 || Invalid NPDM ACID section sizePath already exists.
|-
| 0x234602 0xE02 || 2 || 4515 7 || Last byte of the ACID modulus is zeroResource already in use (file already opened, savedata filesystem already mounted).
|-
| 0x234802 0x4602 || 2 || 4516 35 || Invalid ACID fixed key signatureNot enough free space for BIS Calibration partition.
|-
| 0x234A02 0x4802 || 2 || 4517 36 || Invalid NCA magicNot enough free space for BIS Safe partition.
|-
| 0x234C02 0x4A02 || 2 || 4518 37 || Invalid NCA header fixed key signatureNot enough free space for BIS User partition.
|-
| 0x234E02 0x4C02 || 2 || 4519 38 || Invalid NCA header ACID signatureNot enough free space for BIS System partition.
|-
| 0x235002 0x4E02 || 2 || 4520 39 || Invalid NCA header section hashNot enough free space on SD card.
|-
| 0x235202 0x6402 || 2 || 4521 50 || Invalid NCA Key indexis older than version 3, or NCA SDK version is older than 0.11.0.0
|-
| 0x235602 0x7802 || 2 || 4523 60 || Invalid encryption typeSpecified mount name already exists.
|-
| 0x235802 0x7D202 || 2 || 4524 1001 || Redirection BKTR table size is negativeProcess does not have RomFs
|-
| 0x235A02 0x7D402 || 2 || 4525 1002 || Encryption BKTR table size is negativeTitle-id not found / savedata not found.
|-
| 0x235C02 0xFA202 || 2 || 4526 2001 || Redirection BKTR table end offset is past the Encryption BKTR table start offsetSD card not inserted
|-
| 0x235E02 0x13B002 || 2 || 4527 2520 || NCA-path used with the wrong titleID.Gamecard not inserted
|-
| 0x236002 0x13B402 || 2 || 4528 2522 || NCA header value is out of rangeAttempted process an AsicHandler command in initial mode
|-
| 0x236202 0x13D802 || 2 || 4529 2540 || NCA FS header value is out of rangeAttempted to read from the secure gamecard partition in normal mode
|-
| 0x236802 0x13DA02 || 2 || 4532 2541 || PartitionFS hash block size is not a power of 2Attempted to read from the normal gamecard partition in secure mode
|-
| 0x236A02 0x13DC02 || 2 || 4533 2542 || PartitionFS hash "always_2" field is not 2Attempted a read that spanned both the normal and secure gamecard partitions
|-
| 0x236C02 0x13E002 || 2 || 4534 2544 || PartitionFS Gamecard initial data hash table is too small for main doesn't match the initial datahash in the card header
|-
| 0x236E02 0x13E202 || 2 || 4535 2545 || Invalid PartitionFS block hashGamecard initial data reserved area is not all zeros
|-
| 0x244402 0x13E402 || 2 || 4642 2546 || Invalid Partition file hashed region boundsGamecard certificate kek index doesn't match card header kek index
|-
| 0x244602 0x13EE02 || 2 || 4643 2551 || Invalid Partition FS hashUnable to read card header on gamecard init
|-
| 0x244802 0x140A02 || 2 || 4644 2565 || Invalid PFS0 magicEncountered SDMMC error in write operation
|-
| 0x244A02 0x145002 || 2 || 4645 2600 || Invalid HFS0 magicAttempted to switch lotus state machine to secure mode from a mode other than normal
|-
| 0x244C02 0x145202 || 2 || 4646 2601 || Invalid name offset for Partition FS file entryAttempted to switch lotus state machine to normal mode from a mode other than initial
|-
| 0x244E02 0x145402 || 2 || 4647 2602 || Calculated Partition FS header size changed between 2 consecutive readsAttempted to switch lotus state machine to write mode from a mode other than normal
|-
| 0x249802 0x149402 || 2 || 4684 2634 || Invalid FAT file number.Error processing lotus command SetUserAsicFirmware
|-
| 0x249C02 0x149A02 || 2 || 4686 2637 || Invalid FAT format for BIS User partition.Error processing lotus command GetAsicCert
|-
| 0x249E02 0x14A002 || 2 || 4687 2640 || Invalid FAT format for BIS System partition.Error processing lotus command SetEmmcEmbeddedSocCertificate
|-
| 0x24A002 0x14AA02 || 2 || 4688 2645 || Invalid FAT format for BIS Safe partition.Error processing lotus command GetAsicEncryptedMessage
|-
| 0x24A202 0x14AC02 || 2 || 4689 2646 || Invalid FAT format for BIS Calibration partition.Error processing lotus command SetLibraryEncryptedMessage
|-
| 0x250E02 0x14B602 || 2 || 4743 2651 || [[NAX0|Corrupted]] NAX0 header.Error processing lotus command GetAsicAuthenticationData
|-
| 0x251002 0x14B802 || 2 || 4744 2652 || Invalid [[NAX0]] magicnum.Error processing lotus command SetAsicAuthenticationDataHash
|-
| 0x280202 0x14BA02 || 2 || 5121 2653 || Invalid FAT sizeError processing lotus command SetLibraryAuthenticationData
|-
| 0x280402 0x14BC02 || 2 || 5122 2654 || Invalid FAT BPB (BIOS Parameter Block)Error processing lotus command GetLibraryAuthenticationDataHash
|-
| 0x280602 0x14C202 || 2 || 5123 2657 || Invalid FAT parameterError processing lotus command ExchangeRandomValuesInSecureMode
|-
| 0x280802 0x14D802 || 2 || 5124 2668 || Invalid FAT sectorError calling nn::gc::detail::GcCrypto::GenerateRandomBytes
|-
| 0x280A02 0x14DE02 || 2 || 5125 2671 || Invalid FAT sectorError processing lotus command ReadAsicRegister
|-
| 0x280C02 0x14E002 || 2 || 5126 2672 || Invalid FAT sectorError processing lotus command GetGameCardIdSet
|-
| 0x280E02 0x14E402 || 2 || 5127 2674 || Invalid FAT sectorError processing lotus command GetCardHeader
|-
| 0x296A02 0x14E802 || 2 || 5301 2676 || Mountpoint not foundError processing lotus command GetCardKeyArea
|-
| 0x2EE202 0x14EA02 || 2 || 6001 2677 || Invalid inputError processing lotus command ChangeDebugMode
|-
| 0x2EE602 0x14EC02 || 2 || 6003 2678 || Path too longError processing lotus command GetRmaInformation
|-
| 0x2EE802 0x150802 || 2 || 6004 2692 || Invalid character.Tried sending lotus card command Refresh when not in secure mode
|-
| 0x2EEA02 0x150A02 || 2 || 6005 2693 || Invalid directory path.Tried sending lotus card command when not in correct mode
|-
| 0x2EEC02 0x155602 || 2 || 6006 2731 || Unable to retrieve directory from pathError processing lotus card command ReadId1
|-
| 0x2F5A02 0x155802 || 2 || 6061 2732 || Offset outside storageError processing lotus card command ReadId2
|-
| 0x313802 0x155A02 || 2 || 6300 2733 || Operation not supportedError processing lotus card command ReadId3
|-
| 0x313A02 0x155E02 || 2 || 6301 2735 || A specified filesystem has no MultiCommitTarget when doing a multi-filesystem commitError processing lotus card command ReadPage
|-
| 0x313C02 0x156202 || 2 || 6302 2737 || Attempted to resize a nn::fs::SubStorage or BufferedStorage that is marked as non-resizableError processing lotus card command WritePage
|-
| 0x313E02 0x156402 || 2 || 6303 2738 || Attempted to resize a nn::fs::SubStorage or BufferedStorage when the SubStorage ends before the base storageError processing lotus card command Refresh
|-
| 0x314002 0x156C02 || 2 || 6304 2742 || Attempted to call nn::fs::MemoryStorage::SetSizeError processing lotus card command ReadCrc
|-
| 0x314202 0x156E02 || 2 || 6305 2743 || Invalid Operation ID in nn::fs::MemoryStorage::OperateRangeError processing lotus card command Erase or UnlockForceErase
|-
| 0x314402 0x157002 || 2 || 6306 2744 || Invalid Operation ID in nn::fs::FileStorage::OperateRangeError processing lotus card command ReadDevParam
|-
| 0x314602 0x157202 || 2 || 6307 2745 || Invalid Operation ID in nn::fs::FileHandleStorage::OperateRangeError processing lotus card command WriteDevParam
|-
| 0x314802 0x16B002 || 2 || 6308 2904 || Invalid Operation ID Id2Normal did not match the value in nn::fssystem::SwitchStorage::OperateRangethe buffer returned by ChangeDebugMode
|-
| 0x314A02 0x16B202 || 2 || 6309 2905 || Invalid Operation ID in nn::fs::detail::StorageServiceObjectAdapter::OperateRangeId1Normal did not match Id1Writer when switching gamecard to write mode
|-
| 0x314C02 0x16B402 || 2 || 6310 2906 || Attempted Id2Normal did not match Id2Writer when switching gamecard to call nn::fssystem::AesCtrCounterExtendedStorage::Writewrite mode
|-
| 0x314E02 0x171402 || 2 || 6311 2954 || Attempted to call nn::fssystem::AesCtrCounterExtendedStorage::SetSizeInvalid gamecard handle.
|-
| 0x315002 0x172002 || 2 || 6312 2960 || Invalid Operation ID in nn::fssystem::AesCtrCounterExtendedStorage::OperateRangegamecard handle when opening normal gamecard partition
|-
| 0x315202 0x172202 || 2 || 6313 2961 || Attempted to call nn::fssystem::AesCtrStorageExternal::WriteInvalid gamecard handle when opening secure gamecard partition
|-
| 0x315402 0x177202 || 2 || 6314 3001 || Attempted to call nn::fssystem::AesCtrStorageExternal::SetSizeUnimplemented behavior
|-
| 0x315602 0x177602 || 2 || 6315 3003 || Attempted to call nn::fssystem::AesCtrStorage::SetSizeFile/Directory already exists.
|-
| 0x315802 0x190202 || 2 || 6316 3201 || Attempted Memory allocation failure related to call nn::fssystem::save::HierarchicalIntegrityVerificationStorage::SetSizeFAT filesystem code
|-
| 0x315A02 0x190602 || 2 || 6317 3203 || Attempted Memory allocation failure related to call nn::fssystem::save::HierarchicalIntegrityVerificationStorage::OperateRangeFAT filesystem code
|-
| 0x315C02 0x190802 || 2 || 6318 3204 || Attempted Memory allocation failure related to call nn::fssystem::save::IntegrityVerificationStorage::SetSizeFAT filesystem code
|-
| 0x315E02 0x190A02 || 2 || 6319 3205 || Attempted Memory allocation failure related to invalidate the cache of a RomFs IVFC storage in nn::fssystem::save::IntegrityVerificationStorage::OperateRangeFAT filesystem code
|-
| 0x316002 0x190C02 || 2 || 6320 3206 || Invalid Operation ID in nn::fssystem::save::IntegrityVerificationStorage::OperateRange Memory allocation failure related to FAT filesystem code
|-
| 0x316202 0x191002 || 2 || 6321 3208 || Attempted Memory allocation failure related to call nn::fssystem::save::BlockCacheBufferedStorage::SetSizeFAT filesystem code
|-
| 0x316402 0x195802 || 2 || 6322 3244 || Attempted Allocation failure related to invalidate the cache of something other than a savedata IVFC storage in nn::fssystem::save::BlockCacheBufferedStorage::OperateRangeSD cards
|-
| 0x316602 0x196002 || 2 || 6323 3248 || Invalid Operation ID in nn::fssystem::save::BlockCacheBufferedStorage::OperateRangeOut of memory
|-
| 0x316802 0x196202 || 2 || 6324 3249 || Attempted to call nn::fssystem::IndirectStorage::WriteOut of memory
|-
| 0x316A02 0x1A3E02 || 2 || 6325 3359 || Attempted to call nn::fssystem::IndirectStorage::SetSizeOut of memory
|-
| 0x316C02 0x1A4002 || 2 || 6326 3360 || Invalid Operation ID in nn::fssystem::IndirectStorage::OperateRangeOut of memory
|-
| 0x316E02 0x1A4A02 || 2 || 6327 3365 || Attempted to call nn::fssystem::SparseStorage::ZeroStorage::WriteOut of memory
|-
| 0x317002 0x21BC02 || 2 || 6328 4318 || Attempted to call nn::fssystem::SparseStorage::ZeroStorage::SetSizeInvalid save data filesystem magic (valid magic is SAVE in ASCII)
|-
| 0x317202 0x234202 || 2 || 6329 4513 || Attempted to call nn::fssystem::HierarchicalSha256Storage::SetSizeError reading ACID section in NPDM
|-
| 0x317402 0x234402 || 2 || 6330 4514 || Attempted to call nn::fssystem::ReadOnlyBlockCacheStorage::WriteInvalid NPDM ACID section size
|-
| 0x317602 0x234602 || 2 || 6331 4515 || Attempted to call nn::fssystem::ReadOnlyBlockCacheStorage::SetSizeLast byte of the ACID modulus is zero
|-
| 0x317802 0x234802 || 2 || 6332 4516 || Attempted to call nn::fssystem::IntegrityRomFsStorage::SetSizeInvalid ACID fixed key signature
|-
| 0x317A02 0x234A02 || 2 || 6333 4517 || Attempted to call nn::fssystem::save::DuplexStorage::SetSizeInvalid NCA magic
|-
| 0x317C02 0x234C02 || 2 || 6334 4518 || Invalid Operation ID in nn::fssystem::save::DuplexStorage::OperateRangeNCA header fixed key signature
|-
| 0x317E02 0x234E02 || 2 || 6335 4519 || Attempted to call nn::fssystem::save::HierarchicalDuplexStorage::SetSizeInvalid NCA header ACID signature
|-
| 0x318002 0x235002 || 2 || 6336 4520 || Attempted to call nn::fssystem::save::RemapStorage::GetSizeInvalid NCA header section hash
|-
| 0x318202 0x235202 || 2 || 6337 4521 || Attempted to call nn::fssystem::save::RemapStorage::SetSizeInvalid NCA Key index
|-
| 0x318402 0x235602 || 2 || 6338 4523 || Invalid Operation ID in nn::fssystem::save::RemapStorage::OperateRangeencryption type
|-
| 0x318602 0x235802 || 2 || 6339 4524 || Attempted to call nn::fssystem::save::IntegritySaveDataStorage::SetSizeRedirection BKTR table size is negative
|-
| 0x318802 0x235A02 || 2 || 6340 4525 || Invalid Operation ID in nn::fssystem::save::IntegritySaveDataStorage::OperateRangeEncryption BKTR table size is negative
|-
| 0x318A02 0x235C02 || 2 || 6341 4526 || Attempted to call nn::fssystem::save::JournalIntegritySaveDataStorage::SetSizeRedirection BKTR table end offset is past the Encryption BKTR table start offset
|-
| 0x318C02 0x235E02 || 2 || 6342 4527 || Invalid Operation ID in nn::fssystem::save::JournalIntegritySaveDataStorage::OperateRangeNCA-path used with the wrong titleID.
|-
| 0x318E02 0x236002 || 2 || 6343 4528 || Attempted to call nn::fssystem::save::JournalStorage::GetSizeNCA header value is out of range
|-
| 0x319002 0x236202 || 2 || 6344 4529 || Attempted to call nn::fssystem::save::JournalStorage::SetSizeNCA FS header value is out of range
|-
| 0x319202 0x236802 || 2 || 6345 4532 || Invalid Operation ID in nn::fssystem::save::JournalStorage::OperateRangePartitionFS hash block size is not a power of 2
|-
| 0x319402 0x236A02 || 2 || 6346 4533 || Attempted to call nn::fssystem::save::UnionStorage::SetSizePartitionFS hash "always_2" field is not 2
|-
| 0x319602 0x236C02 || 2 || 6347 4534 || Attempted to call nn::fssystem::dbm::AllocationTableStorage::SetSizePartitionFS hash table is too small for main data
|-
| 0x319802 0x236E02 || 2 || 6348 4535 || Attempted to call nn::fssrv::fscreator::WriteOnlyGameCardStorage::ReadInvalid PartitionFS block hash
|-
| 0x319A02 0x244402 || 2 || 6349 4642 || Attempted to call nn::fssrv::fscreator::WriteOnlyGameCardStorage::SetSizeInvalid Partition file hashed region bounds
|-
| 0x319C02 0x244602 || 2 || 6350 4643 || Attempted to call nn::fssrv::fscreator::ReadOnlyGameCardStorage::WriteInvalid Partition FS hash
|-
| 0x319E02 0x244802 || 2 || 6351 4644 || Attempted to call nn::fssrv::fscreator::ReadOnlyGameCardStorage::SetSizeInvalid PFS0 magic
|-
| 0x31A002 0x244A02 || 2 || 6352 4645 || Invalid Operation ID in nn::fssrv::fscreator::ReadOnlyGameCardStorage::OperateRangeHFS0 magic
|-
| 0x31A202 0x244C02 || 2 || 6353 4646 || Attempted to call SdStorage::SetSizeInvalid name offset for Partition FS file entry
|-
| 0x31A402 0x244E02 || 2 || 6354 4647 || Invalid Operation ID in SdStorage::OperateRangeCalculated Partition FS header size changed between 2 consecutive reads
|-
| 0x31A602 0x249802 || 2 || 6355 4684 || Invalid Operation ID in nn::fat::FatFile::DoOperateRangeFAT file number.
|-
| 0x31A802 0x249C02 || 2 || 6356 4686 || Invalid Operation ID in nn::fssystem::StorageFile::DoOperateRangeFAT format for BIS User partition.
|-
| 0x31AA02 0x249E02 || 2 || 6357 4687 || Attempted to call nn::fssystem::ConcatenationFile::SetSizeInvalid FAT format for BIS System partition.
|-
| 0x31AC02 0x24A002 || 2 || 6358 4688 || Attempted to call nn::fssystem::ConcatenationFile::OperateRangeInvalid FAT format for BIS Safe partition.
|-
| 0x31AE02 0x24A202 || 2 || 6359 4689 || Invalid Query ID in nn::fssystem::ConcatenationFileSystem::DoQueryEntryFAT format for BIS Calibration partition.
|-
| 0x31B002 0x250E02 || 2 || 6360 4743 || Invalid Operation ID in nn::fssystem::ConcatenationFile::DoOperateRange[[NAX0|Corrupted]] NAX0 header.
|-
| 0x31B202 0x251002 || 2 || 6361 4744 || Attempted to call nn::fssystem::ZeroBitmapFile::SetSizeInvalid [[NAX0]] magicnum.
|-
| 0x31B402 0x280202 || 2 || 6362 5121 || Invalid Operation ID in nn::fs::detail::FileServiceObjectAdapter::DoOperateRangeFAT size
|-
| 0x31B602 0x280402 || 2 || 6363 5122 || Invalid Operation ID in nn::fssystem::AesXtsFile::DoOperateRangeFAT BPB (BIOS Parameter Block)
|-
| 0x31B802 0x280602 || 2 || 6364 5123 || Attempted to modify a nn::fs::RomFsFileSystemInvalid FAT parameter
|-
| 0x31BA02 0x280802 || 2 || 6365 5124 || Attempted to call nn::fs::RomFsFileSystem::DoCommitProvisionallyInvalid FAT sector
|-
| 0x31BC02 0x280A02 || 2 || 6366 5125 || Attempted to query the space in a nn::fs::RomFsFileSystemInvalid FAT sector
|-
| 0x31BE02 0x280C02 || 2 || 6367 5126 || Attempted to modify a nn::fssystem::RomFsFileInvalid FAT sector
|-
| 0x31C002 0x280E02 || 2 || 6368 5127 || Invalid Operation ID in nn::fssystem::RomFsFile::DoOperateRangeFAT sector
|-
| 0x31C202 0x296A02 || 2 || 6369 5301 || Attempted to modify a nn::fs::ReadOnlyFileSystemTemplateMountpoint not found
|-
| 0x31C402 0x2EE202 || 2 || 6370 6001 || Attempted to call nn::fs::ReadOnlyFileSystemTemplate::DoCommitProvisionallyInvalid input
|-
| 0x31C602 0x2EE602 || 2 || 6371 6003 || Attempted to query the space in a nn::fs::ReadOnlyFileSystemTemplatePath too long
|-
| 0x31C802 0x2EE802 || 2 || 6372 6004 || Attempted to modify a nn::fs::ReadOnlyFileSystemFileInvalid character.
|-
| 0x31CA02 0x2EEA02 || 2 || 6373 6005 || Invalid Operation ID in nn::fs::ReadOnlyFileSystemFile::DoOperateRangedirectory path.
|-
| 0x31CC02 0x2EEC02 || 2 || 6374 6006 || Attempted Unable to modify a nn::fssystem::PartitionFileSystemCoreretrieve directory from path
|-
| 0x31CE02 0x2F5A02 || 2 || 6375 6061 || Attempted to call nn::fssystem::PartitionFileSystemCore::DoCommitProvisionallyOffset outside storage
|-
| 0x31D002 0x313802 || 2 || 6376 6300 || Attempted to call nn::fssystem::PartitionFileSystemCore::PartitionFile::DoSetSizeOperation not supported
|-
| 0x31D202 0x313A02 || 2 || 6377 6301 || Invalid Operation ID in nn::fssystem::PartitionFileSystemCore::PartitionFile::DoOperateRangeA specified filesystem has no MultiCommitTarget when doing a multi-filesystem commit
|-
| 0x31D402 0x313C02 || 2 || 6378 6302 || Invalid Operation ID in Attempted to resize a nn::fssystemfs::TmFileSystemFile::DoOperateRangeSubStorage or BufferedStorage that is marked as non-resizable
|-
| 0x31D602 0x313E02 || 2 || 6379 6303 || Attempted to call unsupported functions in resize a nn::fssrvfs::fscreator::SaveDataInternalStorageFileSystem, nn::fssrv::detail::SaveDataInternalStorageAccessor::PaddingFile SubStorage or nn::fssystem::save::detail::SaveDataExtraDataInternalStorageFileBufferedStorage when the SubStorage ends before the base storage
|-
| 0x31DC02 0x314002 || 2 || 6382 6304 || Attempted to call nn::fssystemfs::ApplicationTemporaryFileSystemMemoryStorage::DoCommitProvisionallySetSize
|-
| 0x31DE02 0x314202 || 2 || 6383 6305 || Attempted to call Invalid Operation ID in nn::fssystemfs::SaveDataFileSystemMemoryStorage::DoCommitProvisionallyOperateRange
|-
| 0x31E002 0x314402 || 2 || 6384 6306 || Attempted to call Invalid Operation ID in nn::fssystemfs::DirectorySaveDataFileSystemFileStorage::DoCommitProvisionallyOperateRange
|-
| 0x31E202 0x314602 || 2 || 6385 6307 || Attempted to call Invalid Operation ID in nn::fssystemfs::ZeroBitmapHashStorageFileFileHandleStorage::WriteOperateRange
|-
| 0x31E402 0x314802 || 2 || 6386 6308 || Attempted to call Invalid Operation ID in nn::fssystem::ZeroBitmapHashStorageFileSwitchStorage::SetSizeOperateRange
|-
| 0x320002 0x314A02 || 2 || 6400 6309 || Permission deniedInvalid Operation ID in nn::fs::detail::StorageServiceObjectAdapter::OperateRange
|-
| 0x326602 0x314C02 || 2 || 6451 6310 || Missing titlekey(?) required Attempted to mount contentcall nn::fssystem::AesCtrCounterExtendedStorage::Write
|-
| 0x326E02 0x314E02 || 2 || 6455 6311 || File not closedAttempted to call nn::fssystem::AesCtrCounterExtendedStorage::SetSize
|-
| 0x327002 0x315002 || 2 || 6456 6312 || Directory not closedInvalid Operation ID in nn::fssystem::AesCtrCounterExtendedStorage::OperateRange
|-
| 0x327202 0x315202 || 2 || 6457 6313 || Writable file not closed when committingAttempted to call nn::fssystem::AesCtrStorageExternal::Write
|-
| 0x327402 0x315402 || 2 || 6458 6314 || FS allocators already registeredAttempted to call nn::fssystem::AesCtrStorageExternal::SetSize
|-
| 0x327602 0x315602 || 2 || 6459 6315 || FS allocators already usedAttempted to call nn::fssystem::AesCtrStorage::SetSize
|-
| 0x327A02 0x315802 || 2 || 6461 6316 || FS allocator alignment violationAttempted to call nn::fssystem::save::HierarchicalIntegrityVerificationStorage::SetSize
|-
| 0x339402 0x315A02 || 2 || 6602 6317 || File not found.Attempted to call nn::fssystem::save::HierarchicalIntegrityVerificationStorage::OperateRange
|-
| 0x339602 0x315C02 || 2 || 6603 6318 || Directory not found.Attempted to call nn::fssystem::save::IntegrityVerificationStorage::SetSize
|-
| 0x346C02 0x315E02 || 2 || 6710 6319 || Multi-commit limit reachedAttempted to invalidate the cache of a RomFs IVFC storage in nn::fssystem::save::IntegrityVerificationStorage::OperateRange
|-
| 0x35F202 0x316002 || 2 || 6905 6320 || Mount name not found Invalid Operation ID in table.nn::fssystem::save::IntegrityVerificationStorage::OperateRange
|-
| 0x3DBC02 0x316202 || 2 || 7902 6321 || RomFs tableAttempted to call nn: Entry not found in dictionary:fssystem::save::BlockCacheBufferedStorage::SetSize
|-
| 0x3DBE02 0x316402 || 2 || 7903 6322 || RomFs tableAttempted to invalidate the cache of something other than a savedata IVFC storage in nn: File not found:fssystem::save::BlockCacheBufferedStorage::OperateRange
|-
| 0x3DC002 0x316602 || 2 || 7904 6323 || RomFs tableInvalid Operation ID in nn: Directory not found:fssystem::save::BlockCacheBufferedStorage::OperateRange
|-
| 0x3DC402 0x316802 || 2 || 7906 6324 || RomFs tableAttempted to call nn::fssystem: Entry already exists when trying to add a new entry:IndirectStorage::Write
|-
| 0x3DC602 0x316A02 || 2 || 7907 6325 || RomFs tableAttempted to call nn::fssystem: Insufficient space to add new entry:IndirectStorage::SetSize
|-
| 0x3DC802 0x316C02 || 2 || 7908 6326 || RomFs tableInvalid Operation ID in nn: Unable to add new directory:fssystem::IndirectStorage::OperateRange
|-
| 0x3DCA02 0x316E02 || 2 || 7909 6327 || RomFs tableAttempted to call nn: Unable to add new file:fssystem::SparseStorage::ZeroStorage::Write
|-
| 0x3DCC02 0x317002 || 2 || 7910 6328 || RomFs directory has no more child directories/files when iteratingAttempted to call nn::fssystem::SparseStorage::ZeroStorage::SetSize
|-
| 0x3DD402 0x317202 || 2 || 7914 6329 || RomFs tableAttempted to call nn: Path is file, not directory:fssystem::HierarchicalSha256Storage::SetSize
|-
| 0x803 0x317402 || 3 2 || 4 6330 || OS busyAttempted to call nn::fssystem::ReadOnlyBlockCacheStorage::Write
|-
| 0xE03 0x317602 || 3 2 || 7 6331 || Invalid parameterAttempted to call nn::fssystem::ReadOnlyBlockCacheStorage::SetSize
|-
| 0x1003 0x317802 || 3 2 || 8 6332 || Out of memoryAttempted to call nn::fssystem::IntegrityRomFsStorage::SetSize
|-
| 0x1203 0x317A02 || 3 2 || 9 6333 || Out of resourcesAttempted to call nn::fssystem::save::DuplexStorage::SetSize
|-
| 0x3EA03 0x317C02 || 3 2 || 501 6334 || Invalid handleOperation ID in nn::fssystem::save::DuplexStorage::OperateRange
|-
| 0x3EE03 0x317E02 || 3 2 || 503 6335 || Invalid memory mirrorAttempted to call nn::fssystem::save::HierarchicalDuplexStorage::SetSize
|-
| 0x7FE03 0x318002 || 3 2 || 1023 6336 || TLS slot is not allocatedAttempted to call nn::fssystem::save::RemapStorage::GetSize
|-
| 0xA05 0x318202 || 5 2 || 5 6337 || [[Content_Manager_services|NcaID]] not found. Returned when attempting Attempted to mount titles which exist that aren't *8XX titles, the same way *8XX titles are mounted.call nn::fssystem::save::RemapStorage::SetSize
|-
| 0xE05 0x318402 || 5 2 || 7 6338 || TitleId not foundInvalid Operation ID in nn::fssystem::save::RemapStorage::OperateRange
|-
| 0x1805 0x318602 || 5 2 || 12 6339 || Invalid StorageIdAttempted to call nn::fssystem::save::IntegritySaveDataStorage::SetSize
|-
| 0xDC05 0x318802 || 5 2 || 110 6340 || Gamecard not insertedInvalid Operation ID in nn::fssystem::save::IntegritySaveDataStorage::OperateRange
|-
| 0x17C05 0x318A02 || 5 2 || 190 6341 || Gamecard not initializedAttempted to call nn::fssystem::save::JournalIntegritySaveDataStorage::SetSize
|-
| 0x1F405 0x318C02 || 5 2 || 250 6342 || Sdcard not insertedInvalid Operation ID in nn::fssystem::save::JournalIntegritySaveDataStorage::OperateRange
|-
| 0x20805 0x318E02 || 5 2 || 260 6343 || Storage not mountedAttempted to call nn::fssystem::save::JournalStorage::GetSize
|-
| 0x806 0x319002 || 6 2 || 4 6344 || Converted from error 0xD401Attempted to call nn::fssystem::save::JournalStorage::SetSize
|-
| 0x1006 0x319202 || 6 2 || 8 6345 || Converted from error 0xE401Invalid Operation ID in nn::fssystem::save::JournalStorage::OperateRange
|-
| 0x408 0x319402 || 8 2 || 2 6346 || Program location entry not foundAttempted to call nn::fssystem::save::UnionStorage::SetSize
|-
| 0x608 0x319602 || 8 2 || 3 6347 || Invalid context for control locationAttempted to call nn::fssystem::dbm::AllocationTableStorage::SetSize
|-
| 0x808 0x319802 || 8 2 || 4 6348 || Storage not foundAttempted to call nn::fssrv::fscreator::WriteOnlyGameCardStorage::Read
|-
| 0xA08 0x319A02 || 8 2 || 5 6349 || Access deniedAttempted to call nn::fssrv::fscreator::WriteOnlyGameCardStorage::SetSize
|-
| 0xC08 0x319C02 || 8 2 || 6 6350 || Offline manual HTML location entry not foundAttempted to call nn::fssrv::fscreator::ReadOnlyGameCardStorage::Write
|-
| 0xE08 0x319E02 || 8 2 || 7 6351 || Title is not registeredAttempted to call nn::fssrv::fscreator::ReadOnlyGameCardStorage::SetSize
|-
| 0x1008 0x31A002 || 8 2 || 8 6352 || Control location entry for host not foundInvalid Operation ID in nn::fssrv::fscreator::ReadOnlyGameCardStorage::OperateRange
|-
| 0x1208 0x31A202 || 8 2 || 9 6353 || Legal info HTML location entry not foundAttempted to call SdStorage::SetSize
|-
| 0x1408 0x31A402 || 8 2 || 10 6354 || Program location for debug entry not foundInvalid Operation ID in SdStorage::OperateRange
|-
| 0x209 0x31A602 || 9 2 || 1 6355 || Args too long.Invalid Operation ID in nn::fat::FatFile::DoOperateRange
|-
| 0x409 0x31A802 || 9 2 || 2 6356 || Maximum processes loaded.Invalid Operation ID in nn::fssystem::StorageFile::DoOperateRange
|-
| 0x609 0x31AA02 || 9 2 || 3 6357 || NPDM too big.Attempted to call nn::fssystem::ConcatenationFile::SetSize
|-
| 0x809 0x31AC02 || 9 2 || 4 6358 || Invalid NPDM.Attempted to call nn::fssystem::ConcatenationFile::OperateRange
|-
| 0xA09 0x31AE02 || 9 2 || 5 6359 || Invalid NSO.Query ID in nn::fssystem::ConcatenationFileSystem::DoQueryEntry
|-
| 0xC09 0x31B002 || 9 2 || 6 6360 || Invalid Path.Operation ID in nn::fssystem::ConcatenationFile::DoOperateRange
|-
| 0xE09 0x31B202 || 9 2 || 7 6361 || Already registered.Attempted to call nn::fssystem::ZeroBitmapFile::SetSize
|-
| 0x1009 0x31B402 || 9 2 || 8 6362 || Title not found.Invalid Operation ID in nn::fs::detail::FileServiceObjectAdapter::DoOperateRange
|-
| 0x1209 0x31B602 || 9 2 || 9 6363 || Title-id Invalid Operation ID in ACI0 doesn't match range in ACID.nn::fssystem::AesXtsFile::DoOperateRange
|-
| 0x1409 0x31B802 || 9 2 || 10 6364 || Invalid version in NPDM.Attempted to modify a nn::fs::RomFsFileSystem
|-
| 0x6609 0x31BA02 || 9 2 || 51 6365 || Insufficient address space.Attempted to call nn::fs::RomFsFileSystem::DoCommitProvisionally
|-
| 0x6809 0x31BC02 || 9 2 || 52 6366 || Insufficient NRO.Attempted to query the space in a nn::fs::RomFsFileSystem
|-
| 0x6A09 0x31BE02 || 9 2 || 53 6367 || Invalid NRRAttempted to modify a nn::fssystem::RomFsFile
|-
| 0x6C09 0x31C002 || 9 2 || 54 6368 || Invalid signatureOperation ID in nn::fssystem::RomFsFile::DoOperateRange
|-
| 0x6E09 0x31C202 || 9 2 || 55 6369 || Insufficient NRO registrations.Attempted to modify a nn::fs::ReadOnlyFileSystemTemplate
|-
| 0x7009 0x31C402 || 9 2 || 56 6370 || Insufficient NRR registrations.Attempted to call nn::fs::ReadOnlyFileSystemTemplate::DoCommitProvisionally
|-
| 0x7209 0x31C602 || 9 2 || 57 6371 || NRO Already loaded.Attempted to query the space in a nn::fs::ReadOnlyFileSystemTemplate
|-
| 0xA209 0x31C802 || 9 2 || 81 6372 || Unaligned NRR addressAttempted to modify a nn::fs::ReadOnlyFileSystemFile
|-
| 0xA409 0x31CA02 || 9 2 || 82 6373 || Bad NRR sizeInvalid Operation ID in nn::fs::ReadOnlyFileSystemFile::DoOperateRange
|-
| 0xA809 0x31CC02 || 9 2 || 84 6374 || NRR Not Loaded.Attempted to modify a nn::fssystem::PartitionFileSystemCore
|-
| 0xAA09 0x31CE02 || 9 2 || 85 6375 || Bad NRR addressAttempted to call nn::fssystem::PartitionFileSystemCore::DoCommitProvisionally
|-
| 0xAE09 0x31D002 || 9 2 || 87 6376 || Bad initializationAttempted to call nn::fssystem::PartitionFileSystemCore::PartitionFile::DoSetSize
|-
| 0xC809 0x31D202 || 9 2 || 100 6377 || Unknown ACI0 descriptorInvalid Operation ID in nn::fssystem::PartitionFileSystemCore::PartitionFile::DoOperateRange
|-
| 0xCE09 0x31D402 || 9 2 || 103 6378 || ACID/ACI0 don't match for descriptor "KernelFlags"Invalid Operation ID in nn::fssystem::TmFileSystemFile::DoOperateRange
|-
| 0xD009 0x31D602 || 9 2 || 104 6379 || ACID/ACI0 don't match for descriptor "SyscallMask"Attempted to call unsupported functions in nn::fssrv::fscreator::SaveDataInternalStorageFileSystem, nn::fssrv::detail::SaveDataInternalStorageAccessor::PaddingFile or nn::fssystem::save::detail::SaveDataExtraDataInternalStorageFile
|-
| 0xD409 0x31DC02 || 9 2 || 106 6382 || ACID/ACI0 don't match for descriptor "MapIoOrNormalRange"Attempted to call nn::fssystem::ApplicationTemporaryFileSystem::DoCommitProvisionally
|-
| 0xD609 0x31DE02 || 9 2 || 107 6383 || ACID/ACI0 don't match for descriptor "MapNormalPage"Attempted to call nn::fssystem::SaveDataFileSystem::DoCommitProvisionally
|-
| 0xDE09 0x31E002 || 9 2 || 111 6384 || ACID/ACI0 don't match for descriptor "InterruptPair"Attempted to call nn::fssystem::DirectorySaveDataFileSystem::DoCommitProvisionally
|-
| 0xE209 0x31E202 || 9 2 || 113 6385 || ACID/ACI0 don't match for descriptor "ApplicationType"Attempted to call nn::fssystem::ZeroBitmapHashStorageFile::Write
|-
| 0xE409 0x31E402 || 9 2 || 114 6386 || ACID/ACI0 don't match for descriptor "KernelReleaseVersion"Attempted to call nn::fssystem::ZeroBitmapHashStorageFile::SetSize
|-
| 0xE609 0x320002 || 9 2 || 115 6400 || ACID/ACI0 don't match for descriptor "HandleTableSize"Permission denied
|-
| 0xE809 0x326602 || 9 2 || 116 6451 || ACID/ACI0 don't match for descriptor "DebugFlags"Missing titlekey(?) required to mount content
|-
| 0x1940A 0x326E02 || 10 2 || 202 6455 || Invalid CMIF header size.File not closed
|-
| 0x1A60A 0x327002 || 10 2 || 211 6456 || Invalid CMIF input header.Directory not closed
|-
| 0x1A80A 0x327202 || 10 2 || 212 6457 || Invalid CMIF output header.Writable file not closed when committing
|-
| 0x1BA0A 0x327402 || 10 2 || 221 6458 || Invalid method dispatch ID.FS allocators already registered
|-
| 0x1D60A 0x327602 || 10 2 || 235 6459 || Invalid in object count.FS allocators already used
|-
| 0x1D80A 0x327A02 || 10 2 || 236 6461 || Invalid out object count.FS allocator alignment violation
|-
| 0x25A0A 0x339402 || 10 2 || 301 6602 || Out of domain entriesFile not found.
|-
| 0x20B 0x339602 || 11 2 || 1 6603 || Unsupported operationDirectory not found.
|-
| 0xCC0B 0x346C02 || 11 2 || 102 6710 || Out of server session memoryMulti-commit limit reached
|-
| 0x11A0B 0x35F202 || 11 2 || 141 6905 || Went past maximum during marshallingMount name not found in table.
|-
| 0x1900B 0x3DBC02 || 11 2 || 200 7902 || Session doesn't support domains.RomFs table: Entry not found in dictionary
|-
| 0x25A0B 0x3DBE02 || 11 2 || 301 7903 || Remote process is dead.RomFs table: File not found
|-
| 0x3260B 0x3DC002 || 11 2 || 403 7904 || Unknown request typeRomFs table: Directory not found
|-
| 0x3D60B 0x3DC402 || 11 2 || 491 7906 || IPC Query 1 failed.RomFs table: Entry already exists when trying to add a new entry
|-
| 0x20F 0x3DC602 || 15 2 || 1 7907 || Pid not foundRomFs table: Insufficient space to add new entry
|-
| 0x60F 0x3DC802 || 15 2 || 3 7908 || Process has no pending eventsRomFs table: Unable to add new directory
|-
| 0xA0F 0x3DCA02 || 15 2 || 5 7909 || Application already runningRomFs table: Unable to add new file
|-
| 0x410 0x3DCC02 || 16 2 || 2 7910 || Title-id not foundRomFs directory has no more child directories/files when iterating
|-
| 0xF010 0x3DD402 || 16 2 || 120 7914 || Sysupdate RomFs table: Path is file, not requireddirectory
|-
| 0x1F610 0x803 || 16 3 || 251 4 || Unexpected StorageIdOS busy
|-
| 0x2A810 0xE03 || 16 3 || 340 7 || [[Network_Interface_services#IsAnyInternetRequestAccepted|IsAnyInternetRequestAccepted]] with the output from [[#Network_Interface_services#GetClientId|GetClientId]] returned false.Invalid parameter
|-
| 0x64210 0x1003 || 16 3 || 801 8 || [[NS_Services#SystemDeliveryInfo|SystemDeliveryInfo]] system_delivery_protocol_version is less than the system-setting.Out of memory
|-
| 0x64410 0x1203 || 16 3 || 802 9 || [[NS_Services#SystemDeliveryInfo|SystemDeliveryInfo]] system_delivery_protocol_version is larger than the system-setting.Out of resources
|-
| 0x74610 0x3EA03 || 16 3 || 931 501 || Invalid [[NS_Services#SystemDeliveryInfo|SystemDeliveryInfo]] HMAC / invalid Meta Id.handle
|-
| 0x6F810 0x3EE03 || 16 3 || 892 503 || Unknown state ref-count is zero.Invalid memory mirror
|-
| 0x215 0x7FE03 || 21 3 || 1 1023 || Out of processesTLS slot is not allocated
|-
| 0x415 0xA05 || 21 5 || 2 5 || Not initialized[[Content_Manager_services|NcaID]] not found. Returned when attempting to mount titles which exist that aren't *8XX titles, the same way *8XX titles are mounted.
|-
| 0x615 0xE05 || 21 5 || 3 7 || Max sessionsTitleId not found
|-
| 0x815 0x1805 || 21 5 || 4 12 || Service already registeredInvalid StorageId
|-
| 0xA15 0xDC05 || 21 5 || 5 110 || Out of servicesGamecard not inserted
|-
| 0xC15 0x17C05 || 21 5 || 6 190 || Invalid name (all zeroes)Gamecard not initialized
|-
| 0xE15 0x1F405 || 21 5 || 7 250 || Service Sdcard not registeredinserted
|-
| 0x1015 0x20805 || 21 5 || 8 260 || Permission deniedStorage not mounted
|-
| 0x1215 0x806 || 21 6 || 9 4 || Service Access Control too big.Converted from error 0xD401
|-
| 0x416 0x1006 || 22 6 || 2 8 || Address space is fullConverted from error 0xE401
|-
| 0x616 0x408 || 22 8 || 3 2 || NRO already loadedProgram location entry not found
|-
| 0x816 0x608 || 22 8 || 4 3 || Invalid NRO header valuescontext for control location
|-
| 0xC16 0x808 || 22 8 || 6 4 || Bad NRR magicStorage not found
|-
| 0x1016 0xA08 || 22 8 || 8 5 || Reached max NRR countAccess denied
|-
| 0x1216 0xC08 || 22 8 || 9 6 || Unable to verify NRO hash or NRR signatureOffline manual HTML location entry not found
|-
| 0x80216 0xE08 || 22 8 || 1025 7 || Address Title is not page-alignedregistered
|-
| 0x80416 0x1008 || 22 8 || 1026 8 || Incorrect NRO sizeControl location entry for host not found
|-
| 0x80816 0x1208 || 22 8 || 1028 9 || NRO Legal info HTML location entry not loadedfound
|-
| 0x80A16 0x1408 || 22 8 || 1029 10 || NRR Program location for debug entry not loadedfound
|-
| 0x80C16 0x209 || 22 9 || 1030 1 || Already initializedArgs too long.
|-
| 0x80E16 0x409 || 22 9 || 1031 2 || Not initializedMaximum processes loaded.
|-
| 0x21A 0x609 || 26 9 || 1 3 || SMC is not implementedNPDM too big.
|-
| 0x41A 0x809 || 26 9 || 2 4 || SMC argument is invalidInvalid NPDM.
|-
| 0x61A 0xA09 || 26 9 || 3 5 || SMC is currently in progress/secmon is busyInvalid NSO.
|-
| 0x81A 0xC09 || 26 9 || 4 6 || Secmon not currently performing async operationInvalid Path.
|-
| 0xA1A 0xE09 || 26 9 || 5 7 || Invalid SMC async callback keyAlready registered.
|-
| 0xC1A 0x1009 || 26 9 || 6 8 || SMC is blacklisted during current bootTitle not found.
|-
| 0xC81A 0x1209 || 26 9 || 100 9 || Invalid (buffer) sizeTitle-id in ACI0 doesn't match range in ACID.
|-
| 0xCA1A 0x1409 || 26 9 || 101 10 || Unknown SMC errorInvalid version in NPDM.
|-
| 0xCA1A 0x6609 || 26 9 || 101 51 || Decryption failureInsufficient address space.
|-
| 0xD01A 0x6809 || 26 9 || 104 52 || No AES keyslots availableInsufficient NRO.
|-
| 0xD21A 0x6A09 || 26 9 || 105 53 || Invalid AES keyslotNRR
|-
| 0xD41A 0x6C09 || 26 9 || 106 54 || BootReason already setInvalid signature
|-
| 0xD61A 0x6E09 || 26 9 || 107 55 || BootReason not setInsufficient NRO registrations.
|-
| 0xD81A 0x7009 || 26 9 || 108 56 || Invalid argumentInsufficient NRR registrations.
|-
| 0x35B 0x7209 || 347 9 || 1 57 || Failed to init SMNRO Already loaded.
|-
| 0x55B 0xA209 || 347 9 || 2 81 || Failed to init FS.Unaligned NRR address
|-
| 0x75B 0xA409 || 347 9 || 3 82 || Failed to open NRO file. May also happen when SD card isn't inserted / SD mounting failed earlier.Bad NRR size
|-
| 0x95B 0xA809 || 347 9 || 4 84 || Failed to read NRO headerNRR Not Loaded.
|-
| 0xB5B 0xAA09 || 347 9 || 5 85 || Invalid NRO magic.Bad NRR address
|-
| 0xD5B 0xAE09 || 347 9 || 6 87 || Invalid NRO segments.Bad initialization
|-
| 0xF5B 0xC809 || 347 9 || 7 100 || Failed to read NRO.Unknown ACI0 descriptor
|-
| 0x135B 0xCE09 || 347 9 || 9 103 || Failed to allocate heap.ACID/ACI0 don't match for descriptor "KernelFlags"
|-
| 0x255B 0xD009 || 347 9 || 18 104 || Failed to map code-binary memory.ACID/ACI0 don't match for descriptor "SyscallMask"
|-
| 0x275B 0xD409 || 347 9 || 19 106 || Failed to map code memory (.text).ACID/ACI0 don't match for descriptor "MapIoOrNormalRange"
|-
| 0x295B 0xD609 || 347 9 || 20 107 || Failed to map code memory (.rodata).ACID/ACI0 don't match for descriptor "MapNormalPage"
|-
| 0x2B5B 0xDE09 || 347 9 || 21 111 || Failed to map code memory (.data+.bss).ACID/ACI0 don't match for descriptor "InterruptPair"
|-
| 0x315B 0xE209 || 347 9 || 24 113 || Failed to unmap code memory (.text).ACID/ACI0 don't match for descriptor "ApplicationType"
|-
| 0x335B 0xE409 || 347 9 || 25 114 || Failed to unmap code memory (.rodata).ACID/ACI0 don't match for descriptor "KernelReleaseVersion"
|-
| 0x355B 0xE609 || 347 9 || 26 115 || Failed to unmap code memory (.data+.bss).ACID/ACI0 don't match for descriptor "HandleTableSize"
|-
| 0x19269 0xE809 || 105 9 || 201 116 || Null settings nameACID/ACI0 don't match for descriptor "DebugFlags"
|-
| 0x19469 0x1940A || 105 10 || 202 || Null settings keyInvalid CMIF header size.
|-
| 0x19669 0x1A60A || 105 10 || 203 211 || Null settings valueInvalid CMIF input header.
|-
| 0x19A69 0x1A80A || 105 10 || 205 212 || Null settings value bufferInvalid CMIF output header.
|-
| 0x1A069 0x1BA0A || 105 10 || 208 221 || Null setting value size bufferInvalid method dispatch ID.
|-
| 0x1A269 0x1D60A || 105 10 || 209 235 || Null debug mode flag bufferInvalid in object count.
|-
| 0x1BA69 0x1D80A || 105 10 || 221 236 || Setting group name has zero lengthInvalid out object count.
|-
| 0x1BC69 0x25A0A || 105 10 || 222 301 || Empty settings item keyOut of domain entries.
|-
| 0x1E269 0x20B || 105 11 || 241 1 || Setting group name is too long (64 character limit?)Unsupported operation
|-
| 0x1E469 0xCC0B || 105 11 || 242 102 || Setting name is too long (64 character limit?)Out of server session memory
|-
| 0x20A69 0x11A0B || 105 11 || 261 141 || Setting group name ends with 'Went past maximum during marshalling.' or contains invalid characters (allowed: [a-z0-9_\-.])
|-
| 0x20C69 0x1900B || 105 11 || 262 200 || Setting name ends with Session doesn't support domains.' or contains invalid characters (allowed: [a-z0-9_\-.])
|-
| 0x4DA69 0x25A0B || 105 11 || 621 301 || Null language code bufferRemote process is dead.
|-
| 0x4EE69 0x3240B || 105 11 || 631 402 || Null network settings Data/bufferlength(s) too large for IPC buffer.
|-
| 0x4F069 0x3260B || 105 11 || 632 403 || Null network settings output count bufferUnknown request type
|-
| 0x50269 0x3480B || 105 11 || 641 420 || Null backlight settings bufferNumber(s) of buffers/handles/PIDs passed differ from what method expects.
|-
| 0x51669 0x3D60B || 105 11 || 651 491 || Null Bluetooth device setting bufferIPC Query 1 failed.
|-
| 0x51869 0x20F || 105 15 || 652 1 || Null Bluetooth device setting output count bufferPid not found
|-
| 0x51A69 0x60F || 105 15 || 653 3 || Null Bluetooth enable flag bufferProcess has no pending events
|-
| 0x51C69 0xA0F || 105 15 || 654 5 || Null Bluetooth AFH enable flag bufferApplication already running
|-
| 0x51E69 0x410 || 105 16 || 655 2 || Null Bluetooth boost enable flag bufferTitle-id not found
|-
| 0x52069 0xF010 || 105 16 || 656 120 || Null BLE pairing settings bufferSysupdate not required
|-
| 0x52269 0x1F610 || 105 16 || 657 251 || Null BLE pairing settings entry count bufferUnexpected StorageId
|-
| 0x52A69 0x2A810 || 105 16 || 661 340 || Null external steady clock source ID buffer[[Network_Interface_services#IsAnyInternetRequestAccepted|IsAnyInternetRequestAccepted]] with the output from [[#Network_Interface_services#GetClientId|GetClientId]] returned false.
|-
| 0x52C69 0x64210 || 105 16 || 662 801 || Null user [[NS_Services#SystemDeliveryInfo|SystemDeliveryInfo]] system_delivery_protocol_version is less than the system clock context buffer-setting.
|-
| 0x52E69 0x64410 || 105 16 || 663 802 || Null network [[NS_Services#SystemDeliveryInfo|SystemDeliveryInfo]] system_delivery_protocol_version is larger than the system clock context buffer-setting.
|-
| 0x53069 0x74610 || 105 16 || 664 931 || Null user system clock automatic correction enabled flag bufferInvalid [[NS_Services#SystemDeliveryInfo|SystemDeliveryInfo]] HMAC / invalid Meta Id.
|-
| 0x53269 0x6F810 || 105 16 || 665 892 || Null shutdown RTC value bufferUnknown state ref-count is zero.
|-
| 0x53469 0x215 || 105 21 || 666 1 || Null external steady clock internal offset bufferOut of processes
|-
| 0x53E69 0x415 || 105 21 || 671 2 || Null account settings bufferNot initialized.
|-
| 0x55269 0x615 || 105 21 || 681 3 || Null audio volume bufferMax sessions
|-
| 0x55669 0x815 || 105 21 || 683 4 || Null ForceMuteOnHeadphoneRemoved bufferService already registered
|-
| 0x55869 0xA15 || 105 21 || 684 5 || Null headphone volume warning count bufferOut of services
|-
| 0x55E69 0xC15 || 105 21 || 687 6 || Invalid audio output modename (all zeroes)
|-
| 0x56069 0xE15 || 105 21 || 688 7 || Null headphone volume update flag bufferService not registered
|-
| 0x56669 0x1015 || 105 21 || 691 8 || Null console information upload flag bufferPermission denied
|-
| 0x57A69 0x1215 || 105 21 || 701 9 || Null automatic application download flag bufferService Access Control too big.
|-
| 0x57C69 0x416 || 105 22 || 702 2 || Null notification settings bufferAddress space is full
|-
| 0x57E69 0x616 || 105 22 || 703 3 || Null account notification settings entry count bufferNRO already loaded
|-
| 0x58069 0x816 || 105 22 || 704 4 || Null account notification settings bufferInvalid NRO header values
|-
| 0x58E69 0xC16 || 105 22 || 711 6 || Null vibration master volume bufferBad NRR magic
|-
| 0x59069 0x1016 || 105 22 || 712 8 || Null NX controller settings bufferReached max NRR count
|-
| 0x59269 0x1216 || 105 22 || 713 9 || Null NX controller settings entry count bufferUnable to verify NRO hash or NRR signature
|-
| 0x59469 0x80216 || 105 22 || 714 1025 || Null USB full key enable flag bufferAddress not page-aligned
|-
| 0x5A269 0x80416 || 105 22 || 721 1026 || Null TV settings bufferIncorrect NRO size
|-
| 0x5A469 0x80816 || 105 22 || 722 1028 || Null EDID bufferNRO not loaded
|-
| 0x5B669 0x80A16 || 105 22 || 731 1029 || Null data deletion settings bufferNRR not loaded
|-
| 0x5CA69 0x80C16 || 105 22 || 741 1030 || Null initial system applet program ID bufferAlready initialized
|-
| 0x5CC69 0x80E16 || 105 22 || 742 1031 || Null overlay disp program ID bufferNot initialized
|-
| 0x5CE69 0x21A || 105 26 || 743 1 || Null IsInRepairProcess bufferSMC is not implemented
|-
| 0x5D069 0x41A || 105 26 || 744 2 || Null RequiresRunRepairTimeReviser bufferSMC argument is invalid
|-
| 0x5DE69 0x61A || 105 26 || 751 3 || Null device timezone location name bufferSMC is currently in progress/secmon is busy
|-
| 0x5F269 0x81A || 105 26 || 761 4 || Null primary album storage bufferSecmon not currently performing async operation
|-
| 0x60669 0xA1A || 105 26 || 771 5 || Null USB 3.0 enable flag bufferInvalid SMC async callback key
|-
| 0x60869 0xC1A || 105 26 || 772 6 || Null USB Type-C power source circuit version bufferSMC is blacklisted during current boot
|-
| 0x61A69 0xC81A || 105 26 || 781 100 || Null battery lot Invalid (buffer) size
|-
| 0x62E69 0xCA1A || 105 26 || 791 101 || Null serial number bufferUnknown SMC error
|-
| 0x64269 0xCA1A || 105 26 || 801 101 || Null lock screen flag bufferDecryption failure
|-
| 0x64669 0xD01A || 105 26 || 803 104 || Null color set ID bufferNo AES keyslots available
|-
| 0x64869 0xD21A || 105 26 || 804 105 || Null quest flag bufferInvalid AES keyslot
|-
| 0x64A69 0xD41A || 105 26 || 805 106 || Null wireless certification file size bufferBootReason already set
|-
| 0x64C69 0xD61A || 105 26 || 806 107 || Null wireless certification file bufferBootReason not set
|-
| 0x64E69 0xD81A || 105 26 || 807 108 || Null initial launch settings bufferInvalid argument
|-
| 0x65069 0x1423 || 105 35 || 808 10 || Null device nickname bufferInvalid command ID received by tipc processor.
|-
| 0x65269 0x1E23 || 105 35 || 809 15 || Null battery percentage flag bufferInvalid message format received by tipc processor.
|-
| 0x65469 0xC823 || 105 35 || 810 100 || Null applet launch flags buffertipc request was deferred for future processing (internal to the processor, never returned externally).
|-
| 0x7E869 0xCA23 || 105 35 || 1012 101 || Null wireless LAN enable flag buffertipc object was closed (via close command 0xF, internal, never returned externally).
|-
| 0x7FA69 0x35B || 105 347 || 1021 1 || Null product model bufferFailed to init SM.
|-
| 0x80E69 0x55B || 105 347 || 1031 2 || Null NFC enable flag bufferFailed to init FS.
|-
| 0x82269 0x75B || 105 347 || 1041 3 || Null ECI device certificate bufferFailed to open NRO file. May also happen when SD card isn't inserted / SD mounting failed earlier.
|-
| 0x82469 0x95B || 105 347 || 1042 4 || Null E-Ticket device certificate bufferFailed to read NRO header.
|-
| 0x83669 0xB5B || 105 347 || 1051 5 || Null sleep settings bufferInvalid NRO magic.
|-
| 0x84A69 0xD5B || 105 347 || 1061 6 || Null EULA version bufferInvalid NRO segments.
|-
| 0x84C69 0xF5B || 105 347 || 1062 7 || Null EULA version entry count bufferFailed to read NRO.
|-
| 0x85E69 0x135B || 105 347 || 1071 9 || Null LDN channel bufferFailed to allocate heap.
|-
| 0x87269 0x255B || 105 347 || 1081 18 || Null SSL key bufferFailed to map code-binary memory.
|-
| 0x87469 0x275B || 105 347 || 1082 19 || Null SSL certificate bufferFailed to map code memory (.text).
|-
| 0x88669 0x295B || 105 347 || 1091 20 || Null telemetry flags bufferFailed to map code memory (.rodata).
|-
| 0x89A69 0x2B5B || 105 347 || 1101 21 || Null Gamecard key bufferFailed to map code memory (.data+.bss).
|-
| 0x89C69 0x315B || 105 347 || 1102 24 || Null Gamecard certificate bufferFailed to unmap code memory (.text).
|-
| 0x8AE69 0x335B || 105 347 || 1111 25 || Null PTM battery lot bufferFailed to unmap code memory (.rodata).
|-
| 0x8B069 0x355B || 105 347 || 1112 26 || Null PTM fuel gauge parameter bufferFailed to unmap code memory (.data+.bss).
|-
| 0x8C269 0x19269 || 105 || 1121 201 || Null ECI device key buffersettings name
|-
| 0x8C469 0x19469 || 105 || 1122 202 || Null E-Ticket device settings key buffer
|-
| 0x8D669 0x19669 || 105 || 1131 203 || Null speaker parameter buffersettings value
|-
| 0x8EA69 0x19A69 || 105 || 1141 205 || Null firmware version settings value buffer
|-
| 0x8EC69 0x1A069 || 105 || 1142 208 || Null firmware version digest setting value size buffer
|-
| 0x8EE69 0x1A269 || 105 || 1143 209 || Null rebootless system update version debug mode flag buffer
|-
| 0x8FE69 0x1BA69 || 105 || 1151 221 || Null Mii author ID bufferSetting group name has zero length
|-
| 0x91269 0x1BC69 || 105 || 1161 222 || Null fatal flags bufferEmpty settings item key
|-
| 0x92669 0x1E269 || 105 || 1171 241 || Null auto update enable flag bufferSetting group name is too long (64 character limit?)
|-
| 0x93A69 0x1E469 || 105 || 1181 242 || Null external RTC reset flag bufferSetting name is too long (64 character limit?)
|-
| 0x94E69 0x20A69 || 105 || 1191 261 || Null push notification activity mode bufferSetting group name ends with '.' or contains invalid characters (allowed: [a-z0-9_\-.])
|-
| 0x96269 0x20C69 || 105 || 1201 262 || Null service discovery control setting bufferSetting name ends with '.' or contains invalid characters (allowed: [a-z0-9_\-.])
|-
| 0x97669 0x4DA69 || 105 || 1211 621 || Null error report share permission language code buffer
|-
| 0x98A69 0x4E269 || 105 || 1221 625 || Null LCD vendor ID bufferLanguage out of valid range
|-
| 0x99E69 0x4EE69 || 105 || 1231 631 || Null console SixAxis sensor acceleration bias network settings buffer
|-
| 0x9A069 0x4F069 || 105 || 1232 632 || Null console SixAxis sensor angular velocity bias network settings output count buffer
|-
| 0x9A269 0x50269 || 105 || 1233 641 || Null console SixAxis sensor acceleration gain backlight settings buffer
|-
| 0x9A469 0x51669 || 105 || 1234 651 || Null console SixAxis sensor angular velocity gain Bluetooth device setting buffer
|-
| 0x9A669 0x51869 || 105 || 1235 652 || Null console SixAxis sensor angular velocity time bias Bluetooth device setting output count buffer
|-
| 0x9A869 0x51A69 || 105 || 1236 653 || Null console SixAxis sensor angular acceleration Bluetooth enable flag buffer
|-
| 0x9B269 0x51C69 || 105 || 1241 654 || Null keyboard layout Bluetooth AFH enable flag buffer
|-
| 0x9BA69 0x51E69 || 105 || 1245 655 || Invalid keyboard layoutNull Bluetooth boost enable flag buffer
|-
| 0x9C669 0x52069 || 105 || 1251 656 || Null web inspector flag BLE pairing settings buffer
|-
| 0x9C869 0x52269 || 105 || 1252 657 || Null allowed SSL hosts BLE pairing settings entry count buffer
|-
| 0x9CA69 0x52A69 || 105 || 1253 661 || Null allowed SSL hosts entry count external steady clock source ID buffer
|-
| 0x9CC69 0x52C69 || 105 || 1254 662 || Null host FS mount point user system clock context buffer
|-
| 0x9EE69 0x52E69 || 105 || 1271 663 || Null Amiibo key network system clock context buffer
|-
| 0x9F069 0x53069 || 105 || 1272 664 || Null Amiibo ECQV certificate user system clock automatic correction enabled flag buffer
|-
| 0x9F269 0x53269 || 105 || 1273 665 || Null Amiibo ECDSA certificate shutdown RTC value buffer
|-
| 0x9F469 0x53469 || 105 || 1274 666 || Null Amiibo ECQV BLS key external steady clock internal offset buffer
|-
| 0x9F669 0x53E69 || 105 || 1275 671 || Null Amiibo ECQV BLS certificate account settings buffer
|-
| 0x9F869 0x55269 || 105 || 1276 681 || Null Amiibo ECQV BLS root certificate audio volume buffer
|-
| 0x272 0x55669 || 114 105 || 1 683 || Generic errorNull ForceMuteOnHeadphoneRemoved buffer
|-
| 0xC72 0x55869 || 114 105 || 6 684 || Unsupported operationNull headphone volume warning count buffer
|-
| 0x74 0x55E69 || 116 105 || 0 687 || Time service not initializedInvalid audio output mode
|-
| 0x274 0x56069 || 116 105 || 1 688 || Permission deniedNull headphone volume update flag buffer
|-
| 0xCC74 0x56669 || 116 105 || 102 691 || Time not set / Clock Source Id mismatchNull console information upload flag buffer
|-
| 0x19074 0x57A69 || 116 105 || 200 701 || Invalid time comparisonNull automatic application download flag buffer
|-
| 0x19274 0x57C69 || 116 105 || 201 702 || Signed overflow/underflowNull notification settings buffer
|-
| 0x64274 0x57E69 || 116 105 || 801 703 || Memory allocation failureNull account notification settings entry count buffer
|-
| 0x70A74 0x58069 || 116 105 || 901 704 || Null pointeraccount notification settings buffer
|-
| 0x70C74 0x58E69 || 116 105 || 902 711 || Value out of valid rangeNull vibration master volume buffer
|-
| 0x70E74 0x59069 || 116 105 || 903 712 || TimeZoneRule conversion failedNull NX controller settings buffer
|-
| 0x7BA74 0x59269 || 116 105 || 989 713 || TimeZone location name not foundNull NX controller settings entry count buffer
|-
| 0x7BC74 0x59469 || 116 105 || 990 714 || Unimplemented functionalityNull USB full key enable flag buffer
|-
| 0xC79 0x5A269 || 121 105 || 6 721 || [[Network_Interface_services#IsAnyInternetRequestAccepted|IsAnyInternetRequestAccepted]] with the output from [[#Network_Interface_services#GetClientId|GetClientId]] returned false.Null TV settings buffer
|-
| 0x27A 0x5A469 || 122 105 || 1 722 || Invalid argumentNull EDID buffer
|-
| 0x47A 0x5B669 || 122 105 || 2 731 || Object not foundNull data deletion settings buffer
|-
| 0x67A 0x5CA69 || 122 105 || 3 741 || Object locked/in usedNull initial system applet program ID buffer
|-
| 0x87A 0x5CC69 || 122 105 || 4 742 || Target already mountedNull overlay disp program ID buffer
|-
| 0xA7A 0x5CE69 || 122 105 || 5 743 || Target not mountedNull IsInRepairProcess buffer
|-
| 0xC7A 0x5D069 || 122 105 || 6 744 || Object already openedNull RequiresRunRepairTimeReviser buffer
|-
| 0xE7A 0x5DE69 || 122 105 || 7 751 || Object not openedNull device timezone location name buffer
|-
| 0x107A 0x5F269 || 122 105 || 8 761 || [[Network_Interface_services#IsAnyInternetRequestAccepted|IsAnyInternetRequestAccepted]] with the output from [[#Network_Interface_services#GetClientId|GetClientId]] returned false.Null primary album storage buffer
|-
| 0xA07A 0x60669 || 122 105 || 80 771 || Passphrase not foundNull USB 3.0 enable flag buffer
|-
| 0xA27A 0x60869 || 122 105 || 81 772 || Data verification failedNull USB Type-C power source circuit version buffer
|-
| 0xB47A 0x61A69 || 122 105 || 90 781 || Invalid API callNull battery lot buffer
|-
| 0xC47A 0x62E69 || 122 105 || 98 791 || Invalid operationNull serial number buffer
|-
| 0x167B 0x64269 || 123 105 || 11 801 || Converted from [https://developer.mozilla.org/en-US/docs/Mozilla/Projects/NSS/SSL_functions/sslerr.html NSS] SEC errors: -8192 (SEC_ERROR_IO), -8191 (SEC_ERROR_LIBRARY_FAILURE), -8190 (SEC_ERROR_BAD_DATA), -8189 (SEC_ERROR_OUTPUT_LEN), -8188 (SEC_ERROR_INPUT_LEN), -8187 (SEC_ERROR_INVALID_ARGS), -8186 (SEC_ERROR_INVALID_ALGORITHM), -8184 (SEC_ERROR_INVALID_TIME), -8152 (SEC_ERROR_INVALID_KEY). Also converted from [https://developer.mozilla.org/en-US/docs/Mozilla/Projects/NSPR/Reference/NSPR_Error_Handling NSPR] errors: -5991 (PR_IO_ERROR), -5962 (PR_BUFFER_OVERFLOW_ERROR), -5950 (PR_FILE_NOT_FOUND_ERROR), -5949 (PR_NOT_DIRECTORY_ERROR), -5946 (PR_FILESYSTEM_MOUNTED_ERROR), -5938 (PR_END_OF_FILE_ERROR). Also converted from [https://developer.mozilla.org/en-US/docs/Mozilla/Projects/NSS/SSL_functions/sslerr.html NSS] SSL errors: -12223 (SSL_ERROR_GENERATE_RANDOM_FAILURE), -12222 (SSL_ERROR_SIGN_HASHES_FAILURE), -12221 (SSL_ERROR_EXTRACT_PUBLIC_KEY_FAILURE), -12219 (SSL_ERROR_CLIENT_KEY_EXCHANGE_FAILURE), -12218 (SSL_ERROR_ENCRYPTION_FAILURE), -12217 (SSL_ERROR_DECRYPTION_FAILURE), -12216 (SSL_ERROR_SOCKET_WRITE_FAILURE), -12212 (SSL_ERROR_SYM_KEY_CONTEXT_FAILURE), -12209 (SSL_ERROR_IV_PARAM_FAILURE), -12207 (SSL_ERROR_SESSION_KEY_GEN_FAILURE), -12203 (SSL_ERROR_NO_COMPRESSION_OVERLAP), -12202 (SSL_ERROR_HANDSHAKE_NOT_COMPLETED), -12201 (SSL_ERROR_BAD_HANDSHAKE_HASH_VALUE), -12172 (SSL_ERROR_NEXT_PROTOCOL_DATA_INVALID).Null lock screen flag buffer
|-
| 0x1A7B 0x64669 || 123 105 || 13 803 || Unrecognized error.Null color set ID buffer
|-
| 0xCC7B 0x64869 || 123 105 || 102 804 || Converted from [https://developer.mozilla.org/en-US/docs/Mozilla/Projects/NSS/SSL_functions/sslerr.html NSS] SEC error -8173 (SEC_ERROR_NO_MEMORY). Also converted from [https://developer.mozilla.org/en-US/docs/Mozilla/Projects/NSPR/Reference/NSPR_Error_Handling NSPR] errors: -6000 (PR_OUT_OF_MEMORY_ERROR), -5974 (PR_INSUFFICIENT_RESOURCES_ERROR, -5971 (PR_PROC_DESC_TABLE_FULL_ERROR).Null quest flag buffer
|-
| 0xE87B 0x64A69 || 123 105 || 116 805 || Converted from [https://developer.mozilla.org/en-US/docs/Mozilla/Projects/NSPR/Reference/NSPR_Error_Handling NSPR] error -5999 (PR_BAD_DESCRIPTOR_ERROR).Null wireless certification file size buffer
|-
| 0x1987B 0x64C69 || 123 105 || 204 806 || Converted from [https://developer.mozilla.org/en-US/docs/Mozilla/Projects/NSPR/Reference/NSPR_Error_Handling NSPR] error -5998 (PR_WOULD_BLOCK_ERROR).Null wireless certification file buffer
|-
| 0x19A7B 0x64E69 || 123 105 || 205 807 || Converted from [https://developer.mozilla.org/en-US/docs/Mozilla/Projects/NSPR/Reference/NSPR_Error_Handling NSPR] error -5990 (PR_IO_TIMEOUT_ERROR).Null initial launch settings buffer
|-
| 0x19C7B 0x65069 || 123 105 || 206 808 || Converted from [https://developer.mozilla.org/en-US/docs/Mozilla/Projects/NSPR/Reference/NSPR_Error_Handling NSPR] error -5935 (PR_OPERATION_ABORTED_ERROR).Null device nickname buffer
|-
| 0x1A07B 0x65269 || 123 105 || 208 809 || Converted from [https://developer.mozilla.org/en-US/docs/Mozilla/Projects/NSPR/Reference/NSPR_Error_Handling NSPR] error -5978 (PR_NOT_CONNECTED_ERROR).Null battery percentage flag buffer
|-
| 0x1A27B 0x65469 || 123 105 || 209 810 || Converted from [https://developer.mozilla.org/en-US/docs/Mozilla/Projects/NSPR/Reference/NSPR_Error_Handling NSPR] error -5961 (PR_CONNECT_RESET_ERROR).Null applet launch flags buffer
|-
| 0x1A47B 0x7E869 || 123 105 || 210 1012 || Converted from [https://developer.mozilla.org/en-US/docs/Mozilla/Projects/NSPR/Reference/NSPR_Error_Handling NSPR] error -5928 (PR_CONNECT_ABORTED_ERROR).Null wireless LAN enable flag buffer
|-
| 0x1A67B 0x7FA69 || 123 105 || 211 1021 || Converted from [https://developer.mozilla.org/en-US/docs/Mozilla/Projects/NSPR/Reference/NSPR_Error_Handling NSPR] error -5929 (PR_SOCKET_SHUTDOWN_ERROR).Null product model buffer
|-
| 0x1A87B 0x80E69 || 123 105 || 212 1031 || Converted from [https://developer.mozilla.org/en-US/docs/Mozilla/Projects/NSPR/Reference/NSPR_Error_Handling NSPR] error -5930 (PR_NETWORK_DOWN_ERROR).Null NFC enable flag buffer
|-
| 0x1AE7B 0x82269 || 123 105 || 215 1041 || ClientPki/InternalPki was already previously imported/registered.Null ECI device certificate buffer
|-
| 0x1B47B 0x82469 || 123 105 || 218 1042 || Maximum number of ServerPki objects were already imported.Null E-Ticket device certificate buffer
|-
| 0x25A7B 0x83669 || 123 105 || 301 1051 || Converted from [https://developer.mozilla.org/en-US/docs/Mozilla/Projects/NSS/SSL_functions/sslerr.html NSS] SSL error -12276 (SSL_ERROR_BAD_CERT_DOMAIN).Null sleep settings buffer
|-
| 0x25C7B 0x84A69 || 123 105 || 302 1061 || Converted from [https://developer.mozilla.org/en-US/docs/Mozilla/Projects/NSS/SSL_functions/sslerr.html NSS] SSL error -12285 (SSL_ERROR_NO_CERTIFICATE).Null EULA version buffer
|-
| 0x25E7B 0x84C69 || 123 105 || 303 1062 || Converted from [https://developer.mozilla.org/en-US/docs/Mozilla/Projects/NSS/SSL_functions/sslerr.html NSS] SEC errors: -8181 (SEC_ERROR_EXPIRED_CERTIFICATE), -8162 (SEC_ERROR_EXPIRED_ISSUER_CERTIFICATE).Null EULA version entry count buffer
|-
| 0x2607B 0x85E69 || 123 105 || 304 1071 || Converted from [https://developer.mozilla.org/en-US/docs/Mozilla/Projects/NSS/SSL_functions/sslerr.html NSS] SEC error -8180 (SEC_ERROR_REVOKED_CERTIFICATE).Null LDN channel buffer
|-
| 0x2627B 0x87269 || 123 105 || 305 1081 || Converted from [https://developer.mozilla.org/en-US/docs/Mozilla/Projects/NSS/SSL_functions/sslerr.html NSS] SEC error -8183 (SEC_ERROR_BAD_DER).Null SSL key buffer
|-
| 0x2647B 0x87469 || 123 105 || 306 1082 || Converted from [https://developer.mozilla.org/en-US/docs/Mozilla/Projects/NSS/SSL_functions/sslerr.html NSS] SEC errors: -8102 (SEC_ERROR_INADEQUATE_KEY_USAGE), -8101 (SEC_ERROR_INADEQUATE_CERT_TYPE).Null SSL certificate buffer
|-
| 0x2667B 0x88669 || 123 105 || 307 1091 || Converted from [https://developer.mozilla.org/en-US/docs/Mozilla/Projects/NSS/SSL_functions/sslerr.html NSS] SEC errors: -8185 (SEC_ERROR_INVALID_AVA), -8182 (SEC_ERROR_BAD_SIGNATURE), -8158 (SEC_ERROR_EXTENSION_VALUE_INVALID), -8156 (SEC_ERROR_CA_CERT_INVALID), -8151 (SEC_ERROR_UNKNOWN_CRITICAL_EXTENSION), -8080 (SEC_ERROR_CERT_NOT_IN_NAME_SPACE).Null telemetry flags buffer
|-
| 0x2687B 0x89A69 || 123 105 || 308 1101 || Converted from [https://developer.mozilla.org/en-US/docs/Mozilla/Projects/NSS/SSL_functions/sslerr.html NSS] SEC errors: -8179 (SEC_ERROR_UNKNOWN_ISSUER), -8172 (SEC_ERROR_UNTRUSTED_ISSUER), -8014 (SEC_ERROR_APPLICATION_CALLBACK_ERROR).Null Gamecard key buffer
|-
| 0x26A7B 0x89C69 || 123 105 || 309 1102 || Converted from [https://developer.mozilla.org/en-US/docs/Mozilla/Projects/NSS/SSL_functions/sslerr.html NSS] SEC error -8171 (SEC_ERROR_UNTRUSTED_CERT).Null Gamecard certificate buffer
|-
| 0x26C7B 0x8AE69 || 123 105 || 310 1111 || Converted from [https://developer.mozilla.org/en-US/docs/Mozilla/Projects/NSS/SSL_functions/sslerr.html NSS] SSL errors: -12233 (SSL_ERROR_RX_UNKNOWN_RECORD_TYPE), -12232 (SSL_ERROR_RX_UNKNOWN_HANDSHAKE), -12231 (SSL_ERROR_RX_UNKNOWN_ALERT). This is also returned by ImportClientPki when import fails.Null PTM battery lot buffer
|-
| 0x26E7B 0x8B069 || 123 105 || 311 1112 || Converted from [https://developer.mozilla.org/en-US/docs/Mozilla/Projects/NSS/SSL_functions/sslerr.html NSS] SSL errors: -12261 (SSL_ERROR_RX_MALFORMED_HELLO_REQUEST), -12260 (SSL_ERROR_RX_MALFORMED_CLIENT_HELLO), -12259 (SSL_ERROR_RX_MALFORMED_SERVER_HELLO), -12258 (SSL_ERROR_RX_MALFORMED_CERTIFICATE), -12257 (SSL_ERROR_RX_MALFORMED_SERVER_KEY_EXCH), -12256 (SSL_ERROR_RX_MALFORMED_CERT_REQUEST), -12255 (SSL_ERROR_RX_MALFORMED_HELLO_DONE), -12254 (SSL_ERROR_RX_MALFORMED_CERT_VERIFY), -12253 (SSL_ERROR_RX_MALFORMED_CLIENT_KEY_EXCH), -12252 (SSL_ERROR_RX_MALFORMED_FINISHED), -12251 (SSL_ERROR_RX_MALFORMED_CHANGE_CIPHER), -12250 (SSL_ERROR_RX_MALFORMED_ALERT), -12249 (SSL_ERROR_RX_MALFORMED_HANDSHAKE), -12248 (SSL_ERROR_RX_MALFORMED_APPLICATION_DATA), -12166 (SSL_ERROR_RX_MALFORMED_HELLO_VERIFY_REQUEST).Null PTM fuel gauge parameter buffer
|-
| 0x2707B 0x8C269 || 123 105 || 312 1121 || Converted from [https://developer.mozilla.org/en-US/docs/Mozilla/Projects/NSS/SSL_functions/sslerr.html NSS] SEC error -8144 (SEC_ERROR_UNSUPPORTED_KEYALG). Also converted from [https://developer.mozilla.org/en-US/docs/Mozilla/Projects/NSS/SSL_functions/sslerr.html NSS] SSL errors: -12274 (SSL_ERROR_SSL2_DISABLED), -12247 (SSL_ERROR_RX_UNEXPECTED_HELLO_REQUEST), -12246 (SSL_ERROR_RX_UNEXPECTED_CLIENT_HELLO), -12245 (SSL_ERROR_RX_UNEXPECTED_SERVER_HELLO), -12244 (SSL_ERROR_RX_UNEXPECTED_CERTIFICATE), -12243 (SSL_ERROR_RX_UNEXPECTED_SERVER_KEY_EXCH), -12242 (SSL_ERROR_RX_UNEXPECTED_CERT_REQUEST), -12241 (SSL_ERROR_RX_UNEXPECTED_HELLO_DONE), -12240 (SSL_ERROR_RX_UNEXPECTED_CERT_VERIFY), -12239 (SSL_ERROR_RX_UNEXPECTED_CLIENT_KEY_EXCH), -12238 (SSL_ERROR_RX_UNEXPECTED_FINISHED).Null ECI device key buffer
|-
| 0x2727B 0x8C469 || 123 105 || 313 1122 || Converted from [https://developer.mozilla.org/enNull E-US/docs/Mozilla/Projects/NSS/SSL_functions/sslerr.html NSS] SSL errors: -12237 (SSL_ERROR_RX_UNEXPECTED_CHANGE_CIPHER), -12236 (SSL_ERROR_RX_UNEXPECTED_ALERT), -12235 (SSL_ERROR_RX_UNEXPECTED_HANDSHAKE), -12234 (SSL_ERROR_RX_UNEXPECTED_APPLICATION_DATA).Ticket device key buffer
|-
| 0x2747B 0x8D669 || 123 105 || 314 1131 || Converted from [https://developer.mozilla.org/en-US/docs/Mozilla/Projects/NSS/SSL_functions/sslerr.html NSS] SSL error -12263 (SSL_ERROR_RX_RECORD_TOO_LONG).Null speaker parameter buffer
|-
| 0x2767B 0x8EA69 || 123 105 || 315 1141 || Converted from [https://developer.mozilla.org/en-US/docs/Mozilla/Projects/NSS/SSL_functions/sslerr.html NSS] SSL error -12165 (SSL_ERROR_RX_UNEXPECTED_HELLO_VERIFY_REQUEST).Null firmware version buffer
|-
| 0x2787B 0x8EC69 || 123 105 || 316 1142 || Converted from [https://developer.mozilla.org/en-US/docs/Mozilla/Projects/NSS/SSL_functions/sslerr.html NSS] SSL error -12163 (SSL_ERROR_RX_UNEXPECTED_CERT_STATUS).Null firmware version digest buffer
|-
| 0x27A7B 0x8EE69 || 123 105 || 317 1143 || Converted from [https://developer.mozilla.org/en-US/docs/Mozilla/Projects/NSS/SSL_functions/sslerr.html NSS] SSL error -12160 (SSL_ERROR_INCORRECT_SIGNATURE_ALGORITHM).Null rebootless system update version buffer
|-
| 0x27C7B 0x8FE69 || 123 105 || 318 1151 || Converted from [https://developer.mozilla.org/en-US/docs/Mozilla/Projects/NSS/SSL_functions/sslerr.html NSS] SSL errors: -12173 (SSL_ERROR_WEAK_SERVER_EPHEMERAL_DH_KEY), -12156 (SSL_ERROR_WEAK_SERVER_CERT_KEY).Null Mii author ID buffer
|-
| 0x27E7B 0x91269 || 123 105 || 319 1161 || Converted from [https://developer.mozilla.org/en-US/docs/Mozilla/Projects/NSS/SSL_functions/sslerr.html NSS] SSL error -12273 (SSL_ERROR_BAD_MAC_READ).Null fatal flags buffer
|-
| 0x2827B 0x92669 || 123 105 || 321 1171 || Converted from [https://developer.mozilla.org/en-US/docs/Mozilla/Projects/NSS/SSL_functions/sslerr.html NSS] SSL errors: -12215 (SSL_ERROR_MD5_DIGEST_FAILURE), -12214 (SSL_ERROR_SHA_DIGEST_FAILURE), -12161 (SSL_ERROR_DIGEST_FAILURE).Null auto update enable flag buffer
|-
| 0x2847B 0x93A69 || 123 105 || 322 1181 || Converted from [https://developer.mozilla.org/en-US/docs/Mozilla/Projects/NSS/SSL_functions/sslerr.html NSS] SSL error -12213 (SSL_ERROR_MAC_COMPUTATION_FAILURE).Null external RTC reset flag buffer
|-
| 0x2887B 0x94E69 || 123 105 || 324 1191 || Converted from [https://developer.mozilla.org/en-US/docs/Mozilla/Projects/NSS/SSL_functions/sslerr.html NSS] SEC error -8157 (SEC_ERROR_EXTENSION_NOT_FOUND).Null push notification activity mode buffer
|-
| 0x28A7B 0x96269 || 123 105 || 325 1201 || Converted from [https://developer.mozilla.org/en-US/docs/Mozilla/Projects/NSS/SSL_functions/sslerr.html NSS] SEC error -8049 (SEC_ERROR_UNRECOGNIZED_OID).Null service discovery control setting buffer
|-
| 0x28C7B 0x97669 || 123 105 || 326 1211 || Converted from [https://developer.mozilla.org/en-US/docs/Mozilla/Projects/NSS/SSL_functions/sslerr.html NSS] SEC Null error -8032 (SEC_ERROR_POLICY_VALIDATION_FAILED).report share permission buffer
|-
| 0x2947B 0x98A69 || 123 105 || 330 1221 || Converted from [https://developer.mozilla.org/en-US/docs/Mozilla/Projects/NSS/SSL_functions/sslerr.html NSS] SSL error -12177 (SSL_ERROR_DECOMPRESSION_FAILURE).Null LCD vendor ID buffer
|-
| 0xBBA7B 0x99E69 || 123 105 || 1501 1231 || Converted from [https://developer.mozilla.org/en-US/docs/Mozilla/Projects/NSS/SSL_functions/sslerr.html NSS] SSL error -12230 (SSL_ERROR_CLOSE_NOTIFY_ALERT).Null console SixAxis sensor acceleration bias buffer
|-
| 0xBBC7B 0x9A069 || 123 105 || 1502 1232 || Converted from [https://developer.mozilla.org/en-US/docs/Mozilla/Projects/NSS/SSL_functions/sslerr.html NSS] SSL error -12229 (SSL_ERROR_HANDSHAKE_UNEXPECTED_ALERT).Null console SixAxis sensor angular velocity bias buffer
|-
| 0xBBE7B 0x9A269 || 123 105 || 1503 1233 || Converted from [https://developer.mozilla.org/en-US/docs/Mozilla/Projects/NSS/SSL_functions/sslerr.html NSS] SSL error -12272 (SSL_ERROR_BAD_MAC_ALERT).Null console SixAxis sensor acceleration gain buffer
|-
| 0xBC07B 0x9A469 || 123 105 || 1504 1234 || Converted from [https://developer.mozilla.org/en-US/docs/Mozilla/Projects/NSS/SSL_functions/sslerr.html NSS] SSL error -12197 (SSL_ERROR_DECRYPTION_FAILED_ALERT).Null console SixAxis sensor angular velocity gain buffer
|-
| 0xBC27B 0x9A669 || 123 105 || 1505 1235 || Converted from [https://developer.mozilla.org/en-US/docs/Mozilla/Projects/NSS/SSL_functions/sslerr.html NSS] SSL error -12196 (SSL_ERROR_RECORD_OVERFLOW_ALERT).Null console SixAxis sensor angular velocity time bias buffer
|-
| 0xBC47B 0x9A869 || 123 105 || 1506 1236 || Converted from [https://developer.mozilla.org/en-US/docs/Mozilla/Projects/NSS/SSL_functions/sslerr.html NSS] SSL error -12228 (SSL_ERROR_DECOMPRESSION_FAILURE_ALERT).Null console SixAxis sensor angular acceleration buffer
|-
| 0xBC67B 0x9B269 || 123 105 || 1507 1241 || Converted from [https://developer.mozilla.org/en-US/docs/Mozilla/Projects/NSS/SSL_functions/sslerr.html NSS] SSL error -12227 (SSL_ERROR_HANDSHAKE_FAILURE_ALERT).Null keyboard layout buffer
|-
| 0xBCA7B 0x9BA69 || 123 105 || 1509 1245 || Converted from [https://developer.mozilla.org/en-US/docs/Mozilla/Projects/NSS/SSL_functions/sslerr.html NSS] SSL error -12271 (SSL_ERROR_BAD_CERT_ALERT).Invalid keyboard layout
|-
| 0xBCC7B 0x9C669 || 123 105 || 1510 1251 || Converted from [https://developer.mozilla.org/en-US/docs/Mozilla/Projects/NSS/SSL_functions/sslerr.html NSS] SSL error -12225 (SSL_ERROR_UNSUPPORTED_CERT_ALERT).Null web inspector flag buffer
|-
| 0xBCE7B 0x9C869 || 123 105 || 1511 1252 || Converted from [https://developer.mozilla.org/en-US/docs/Mozilla/Projects/NSS/SSL_functions/sslerr.html NSS] Null allowed SSL error -12270 (SSL_ERROR_REVOKED_CERT_ALERT).hosts buffer
|-
| 0xBD07B 0x9CA69 || 123 105 || 1512 1253 || Converted from [https://developer.mozilla.org/en-US/docs/Mozilla/Projects/NSS/SSL_functions/sslerr.html NSS] Null allowed SSL error -12269 (SSL_ERROR_EXPIRED_CERT_ALERT).hosts entry count buffer
|-
| 0xBD27B 0x9CC69 || 123 105 || 1513 1254 || Converted from [https://developer.mozilla.org/en-US/docs/Mozilla/Projects/NSS/SSL_functions/sslerr.html NSS] SSL error -12224 (SSL_ERROR_CERTIFICATE_UNKNOWN_ALERT).Null host FS mount point buffer
|-
| 0xBD47B 0x9EE69 || 123 105 || 1514 1271 || Converted from [https://developer.mozilla.org/en-US/docs/Mozilla/Projects/NSS/SSL_functions/sslerr.html NSS] SSL error -12226 (SSL_ERROR_ILLEGAL_PARAMETER_ALERT).Null Amiibo key buffer
|-
| 0xBD67B 0x9F069 || 123 105 || 1515 1272 || Converted from [https://developer.mozilla.org/en-US/docs/Mozilla/Projects/NSS/SSL_functions/sslerr.html NSS] SSL error -12195 (SSL_ERROR_UNKNOWN_CA_ALERT).Null Amiibo ECQV certificate buffer
|-
| 0xBD87B 0x9F269 || 123 105 || 1516 1273 || Converted from [https://developer.mozilla.org/en-US/docs/Mozilla/Projects/NSS/SSL_functions/sslerr.html NSS] SSL error -12194 (SSL_ERROR_ACCESS_DENIED_ALERT).Null Amiibo ECDSA certificate buffer
|-
| 0xBDA7B 0x9F469 || 123 105 || 1517 1274 || Converted from [https://developer.mozilla.org/en-US/docs/Mozilla/Projects/NSS/SSL_functions/sslerr.html NSS] SSL error -12193 (SSL_ERROR_DECODE_ERROR_ALERT).Null Amiibo ECQV BLS key buffer
|-
| 0xBDC7B 0x9F669 || 123 105 || 1518 1275 || Converted from [https://developer.mozilla.org/en-US/docs/Mozilla/Projects/NSS/SSL_functions/sslerr.html NSS] SSL error -12192 (SSL_ERROR_DECRYPT_ERROR_ALERT).Null Amiibo ECQV BLS certificate buffer
|-
| 0xBDE7B 0x9F869 || 123 105 || 1519 1276 || Converted from [https://developer.mozilla.org/en-US/docs/Mozilla/Projects/NSS/SSL_functions/sslerr.html NSS] SSL error -12191 (SSL_ERROR_EXPORT_RESTRICTION_ALERT).Null Amiibo ECQV BLS root certificate buffer
|-
| 0xBE07B 0x272 || 123 114 || 1520 1 || Converted from [https://developer.mozilla.org/en-US/docs/Mozilla/Projects/NSS/SSL_functions/sslerr.html NSS] SSL Generic error -12190 (SSL_ERROR_PROTOCOL_VERSION_ALERT).
|-
| 0xBE27B 0xC72 || 123 114 || 1521 6 || Converted from [https://developer.mozilla.org/en-US/docs/Mozilla/Projects/NSS/SSL_functions/sslerr.html NSS] SSL error -12189 (SSL_ERROR_INSUFFICIENT_SECURITY_ALERT).Unsupported operation
|-
| 0xBE47B 0x74 || 123 116 || 1522 0 || Converted from [https://developer.mozilla.org/en-US/docs/Mozilla/Projects/NSS/SSL_functions/sslerr.html NSS] SSL error -12188 (SSL_ERROR_INTERNAL_ERROR_ALERT).Time service not initialized
|-
| 0xBE67B 0x274 || 123 116 || 1523 1 || Converted from [https://developer.mozilla.org/en-US/docs/Mozilla/Projects/NSS/SSL_functions/sslerr.html NSS] SSL error -12157 (SSL_ERROR_INAPPROPRIATE_FALLBACK_ALERT).Permission denied
|-
| 0xBE87B 0xCC74 || 123 116 || 1524 102 || Converted from [https:Time not set //developer.mozilla.org/en-US/docs/Mozilla/Projects/NSS/SSL_functions/sslerr.html NSS] SSL error -12187 (SSL_ERROR_USER_CANCELED_ALERT).Clock Source Id mismatch
|-
| 0xBEA7B 0xCE74 || 123 116 || 1525 103 || Converted from [https://developer.mozilla.org/en-US/docs/Mozilla/Projects/NSS/SSL_functions/sslerr.html NSS] SSL error -12186 (SSL_ERROR_NO_RENEGOTIATION_ALERT).Clock not initialized
|-
| 0xBEC7B 0x19074 || 123 116 || 1526 200 || Converted from [https://developer.mozilla.org/en-US/docs/Mozilla/Projects/NSS/SSL_functions/sslerr.html NSS] SSL error -12184 (SSL_ERROR_UNSUPPORTED_EXTENSION_ALERT).Invalid time comparison
|-
| 0xBEE7B 0x19274 || 123 116 || 1527 201 || Converted from [https:Signed overflow//developer.mozilla.org/en-US/docs/Mozilla/Projects/NSS/SSL_functions/sslerr.html NSS] SSL error -12183 (SSL_ERROR_CERTIFICATE_UNOBTAINABLE_ALERT).underflow
|-
| 0xBF07B 0x64274 || 123 116 || 1528 801 || Converted from [https://developer.mozilla.org/en-US/docs/Mozilla/Projects/NSS/SSL_functions/sslerr.html NSS] SSL error -12182 (SSL_ERROR_UNRECOGNIZED_NAME_ALERT).Memory allocation failure
|-
| 0xBF27B 0x70A74 || 123 116 || 1529 901 || Converted from [https://developer.mozilla.org/en-US/docs/Mozilla/Projects/NSS/SSL_functions/sslerr.html NSS] SSL error -12181 (SSL_ERROR_BAD_CERT_STATUS_RESPONSE_ALERT).Null pointer
|-
| 0xBF47B 0x70C74 || 123 116 || 1530 902 || Converted from [https://developer.mozilla.org/en-US/docs/Mozilla/Projects/NSS/SSL_functions/sslerr.html NSS] SSL error -12180 (SSL_ERROR_BAD_CERT_HASH_VALUE_ALERT).Value out of valid range
|-
| 0x27127B 0x70E74 || 123 116 || 5001 903 || Converted from [https://developer.mozilla.org/en-US/docs/Mozilla/Projects/NSS/SSL_functions/sslerr.html NSS] SSL error -12155 (SSL_ERROR_RX_SHORT_DTLS_READ).TimeZoneRule conversion failed
|-
| 0x271E7B 0x7BA74 || 123 116 || 5007 989 || Out-of-bounds error during error conversion.TimeZone location name not found
|-
| 0x287C 0x7BC74 || 124 116 || 20 990 || Argument is NULLUnimplemented functionality
|-
| 0x2C7C 0xC79 || 124 121 || 22 6 || Argument is invalid[[Network_Interface_services#IsAnyInternetRequestAccepted|IsAnyInternetRequestAccepted]] with the output from [[#Network_Interface_services#GetClientId|GetClientId]] returned false.
|-
| 0x3C7C 0x27A || 124 122 || 30 1 || Bad input buffer sizeInvalid argument
|-
| 0x407C 0x47A || 124 122 || 32 2 || Invalid input bufferObject not found
|-
| 0x767C 0x67A || 124 122 || 59 3 || [[Network_Interface_services#IsAnyInternetRequestAccepted|IsAnyInternetRequestAccepted]] with the output from [[#Network_Interface_services#GetClientId|GetClientId]] returned false.Object locked/in used
|-
| 0x27E 0x87A || 126 122 || 1 4 || Invalid argumentTarget already mounted
|-
| 0x87E 0xA7A || 126 122 || 4 5 || Entry Target not foundmounted
|-
| 0xCE7E 0xC7A || 126 122 || 67 6 || Invalid database signature value (should be "NFDB")Object already opened
|-
| 0xD27E 0xE7A || 126 122 || 69 7 || Invalid database entry countObject not opened
|-
| 0x1987E 0x107A || 126 122 || 204 8 || Development/debug-only behavior[[Network_Interface_services#IsAnyInternetRequestAccepted|IsAnyInternetRequestAccepted]] with the output from [[#Network_Interface_services#GetClientId|GetClientId]] returned false.
|-
| 0x480 0xA07A || 128 122 || 2 80 || IStorage Passphrase not available.found
|-
| 0x4680 0xA27A || 128 122 || 35 81 || Error while launching applet.Data verification failed
|-
| 0x4A80 0xB47A || 128 122 || 37 90 || Title-ID not found. Caused by code 0x410 when applet launch failsInvalid API call
|-
| 0x3E880 0xC47A || 128 122 || 500 98 || Invalid inputoperation
|-
| 0x3EC80 0x167B || 128 123 || 502 11 || IStorage has already been opened by another accessorConverted from [https://developer.mozilla.org/en-US/docs/Mozilla/Projects/NSS/SSL_functions/sslerr.html NSS] SEC errors: -8192 (SEC_ERROR_IO), -8191 (SEC_ERROR_LIBRARY_FAILURE), -8190 (SEC_ERROR_BAD_DATA), -8189 (SEC_ERROR_OUTPUT_LEN), -8188 (SEC_ERROR_INPUT_LEN), -8187 (SEC_ERROR_INVALID_ARGS), -8186 (SEC_ERROR_INVALID_ALGORITHM), -8184 (SEC_ERROR_INVALID_TIME), -8152 (SEC_ERROR_INVALID_KEY). Also converted from [https://developer.mozilla.org/en-US/docs/Mozilla/Projects/NSPR/Reference/NSPR_Error_Handling NSPR] errors: -5991 (PR_IO_ERROR), -5962 (PR_BUFFER_OVERFLOW_ERROR), -5950 (PR_FILE_NOT_FOUND_ERROR), -5949 (PR_NOT_DIRECTORY_ERROR), -5946 (PR_FILESYSTEM_MOUNTED_ERROR), -5938 (PR_END_OF_FILE_ERROR). Also converted from [https://developer.mozilla.org/en-US/docs/Mozilla/Projects/NSS/SSL_functions/sslerr.html NSS] SSL errors: -12223 (SSL_ERROR_GENERATE_RANDOM_FAILURE), -12222 (SSL_ERROR_SIGN_HASHES_FAILURE), -12221 (SSL_ERROR_EXTRACT_PUBLIC_KEY_FAILURE), -12219 (SSL_ERROR_CLIENT_KEY_EXCHANGE_FAILURE), -12218 (SSL_ERROR_ENCRYPTION_FAILURE), -12217 (SSL_ERROR_DECRYPTION_FAILURE), -12216 (SSL_ERROR_SOCKET_WRITE_FAILURE), -12212 (SSL_ERROR_SYM_KEY_CONTEXT_FAILURE), -12209 (SSL_ERROR_IV_PARAM_FAILURE), -12207 (SSL_ERROR_SESSION_KEY_GEN_FAILURE), -12203 (SSL_ERROR_NO_COMPRESSION_OVERLAP), -12202 (SSL_ERROR_HANDSHAKE_NOT_COMPLETED), -12201 (SSL_ERROR_BAD_HANDSHAKE_HASH_VALUE), -12172 (SSL_ERROR_NEXT_PROTOCOL_DATA_INVALID).
|-
| 0x3EE80 0x1A7B || 128 123 || 503 13 || IStorage Read/Write out-of-boundsUnrecognized error.
|-
| 0x3FE80 0xCC7B || 128 123 || 511 102 || IStorage opened as wrong type Converted from [https://developer.mozilla.org/en-US/docs/Mozilla/Projects/NSS/SSL_functions/sslerr.html NSS] SEC error -8173 (data opened as transfermemSEC_ERROR_NO_MEMORY). Also converted from [https://developer.mozilla.org/en-US/docs/Mozilla/Projects/NSPR/Reference/NSPR_Error_Handling NSPR] errors: -6000 (PR_OUT_OF_MEMORY_ERROR), -5974 (PR_INSUFFICIENT_RESOURCES_ERROR, transfermem opened as data-5971 (PR_PROC_DESC_TABLE_FULL_ERROR).
|-
| 0x40080 0xE87B || 128 123 || 512 116 || Unbalanced fatal section leave Converted from [https://developer.mozilla.org/en-US/docs/Mozilla/Projects/NSPR/Reference/NSPR_Error_Handling NSPR] error -5999 (returned when executing LeaveFatalSection without a preceding EnterFatalSection callPR_BAD_DESCRIPTOR_ERROR).
|-
| 0x4B080 0x1027B || 128 123 || 600 129 || Failed to allocate memory for IStorageDER CRL decoding failed.
|-
| 0x59080 0x1987B || 128 123 || 712 204 || Thread stack pool exhausted Converted from [https://developer.mozilla.org/en-US/docs/Mozilla/Projects/NSPR/Reference/NSPR_Error_Handling NSPR] error -5998 (out of memoryPR_WOULD_BLOCK_ERROR).
|-
| 0x79C80 0x19A7B || 128 123 || 974 205 || DebugMode not enabledConverted from [https://developer.mozilla.org/en-US/docs/Mozilla/Projects/NSPR/Reference/NSPR_Error_Handling NSPR] error -5990 (PR_IO_TIMEOUT_ERROR).
|-
| 0x7A880 0x19C7B || 128 123 || 980 206 || <code>amConverted from [https://developer.debug!dev_function<mozilla.org/code> setting needs to be set en-US/ DebugMode not enableddocs/Mozilla/Projects/NSPR/Reference/NSPR_Error_Handling NSPR] error -5935 (PR_OPERATION_ABORTED_ERROR).
|-
| 0x7CC80 0x1A07B || 128 123 || 998 208 || Not implementedConverted from [https://developer.mozilla.org/en-US/docs/Mozilla/Projects/NSPR/Reference/NSPR_Error_Handling NSPR] error -5978 (PR_NOT_CONNECTED_ERROR).
|-
| 0xCC81 0x1A27B || 129 123 || 102 209 || Transmission not agreedConverted from [https://developer.mozilla.org/en-US/docs/Mozilla/Projects/NSPR/Reference/NSPR_Error_Handling NSPR] error -5961 (PR_CONNECT_RESET_ERROR).
|-
| 0xD281 0x1A47B || 129 123 || 105 210 || Network unavailableConverted from [https://developer.mozilla.org/en-US/docs/Mozilla/Projects/NSPR/Reference/NSPR_Error_Handling NSPR] error -5928 (PR_CONNECT_ABORTED_ERROR).
|-
| 0x7DA81 0x1A67B || 129 123 || 1005 211 || HTTP Converted from [https://developer.mozilla.org/en-US/docs/Mozilla/Projects/NSPR/Reference/NSPR_Error_Handling NSPR] error: Couldnt resolve proxy-5929 (PR_SOCKET_SHUTDOWN_ERROR).
|-
| 0x7DC81 0x1A87B || 129 123 || 1006 212 || HTTP Converted from [https://developer.mozilla.org/en-US/docs/Mozilla/Projects/NSPR/Reference/NSPR_Error_Handling NSPR] error: Couldnt resolve host-5930 (PR_NETWORK_DOWN_ERROR).
|-
| 0x7DE81 0x1AE7B || 129 123 || 1007 215 || HTTP error: Couldnt connectClientPki/InternalPki was already previously imported/registered.
|-
| 0x7FE81 0x1B47B || 129 123 || 1023 218 || HTTP error: Write errorMaximum number of ServerPki objects were already imported.
|-
| 0x80481 0x25A7B || 129 123 || 1026 301 || HTTP errorConverted from [https: Read //developer.mozilla.org/en-US/docs/Mozilla/Projects/NSS/SSL_functions/sslerr.html NSS] SSL error-12276 (SSL_ERROR_BAD_CERT_DOMAIN).
|-
| 0x80681 0x25C7B || 129 123 || 1027 302 || HTTP Converted from [https://developer.mozilla.org/en-US/docs/Mozilla/Projects/NSS/SSL_functions/sslerr.html NSS] SSL error: Out of memory-12285 (SSL_ERROR_NO_CERTIFICATE).
|-
| 0x80881 0x25E7B || 129 123 || 1028 303 || HTTP errorConverted from [https: Operation timedout//developer.mozilla.org/en-US/docs/Mozilla/Projects/NSS/SSL_functions/sslerr.html NSS] SEC errors: -8181 (SEC_ERROR_EXPIRED_CERTIFICATE), -8162 (SEC_ERROR_EXPIRED_ISSUER_CERTIFICATE).
|-
| 0x81681 0x2607B || 129 123 || 1035 304 || HTTP errorConverted from [https: SSL connect //developer.mozilla.org/en-US/docs/Mozilla/Projects/NSS/SSL_functions/sslerr.html NSS] SEC error-8180 (SEC_ERROR_REVOKED_CERTIFICATE).
|-
| 0x83681 0x2627B || 129 123 || 1051 305 || HTTP Converted from [https://developer.mozilla.org/en-US/docs/Mozilla/Projects/NSS/SSL_functions/sslerr.html NSS] SEC error: Peer failed verification-8183 (SEC_ERROR_BAD_DER).
|-
| 0x83881 0x2647B || 129 123 || 1052 306 || HTTP errorConverted from [https: Got nothing//developer.mozilla.org/en-US/docs/Mozilla/Projects/NSS/SSL_functions/sslerr.html NSS] SEC errors: -8102 (SEC_ERROR_INADEQUATE_KEY_USAGE), -8101 (SEC_ERROR_INADEQUATE_CERT_TYPE).
|-
| 0x83E81 0x2667B || 129 123 || 1055 307 || HTTP errorConverted from [https: Send error//developer.mozilla.org/en-US/docs/Mozilla/Projects/NSS/SSL_functions/sslerr.html NSS] SEC errors: -8185 (SEC_ERROR_INVALID_AVA), -8182 (SEC_ERROR_BAD_SIGNATURE), -8158 (SEC_ERROR_EXTENSION_VALUE_INVALID), -8156 (SEC_ERROR_CA_CERT_INVALID), -8151 (SEC_ERROR_UNKNOWN_CRITICAL_EXTENSION), -8080 (SEC_ERROR_CERT_NOT_IN_NAME_SPACE).
|-
| 0x84081 0x2687B || 129 123 || 1056 308 || HTTP errorConverted from [https: Recv error//developer.mozilla.org/en-US/docs/Mozilla/Projects/NSS/SSL_functions/sslerr.html NSS] SEC errors: -8179 (SEC_ERROR_UNKNOWN_ISSUER), -8172 (SEC_ERROR_UNTRUSTED_ISSUER), -8014 (SEC_ERROR_APPLICATION_CALLBACK_ERROR).
|-
| 0x84481 0x26A7B || 129 123 || 1058 309 || HTTP Converted from [https://developer.mozilla.org/en-US/docs/Mozilla/Projects/NSS/SSL_functions/sslerr.html NSS] SEC error: SSL cert problem-8171 (SEC_ERROR_UNTRUSTED_CERT).
|-
| 0x84681 0x26C7B || 129 123 || 1059 310 || HTTP errorConverted from [https: //developer.mozilla.org/en-US/docs/Mozilla/Projects/NSS/SSL_functions/sslerr.html NSS] SSL ciphererrors: -12233 (SSL_ERROR_RX_UNKNOWN_RECORD_TYPE), -12232 (SSL_ERROR_RX_UNKNOWN_HANDSHAKE), -12231 (SSL_ERROR_RX_UNKNOWN_ALERT). This is also returned by ImportClientPki when import fails.
|-
| 0x84881 0x26E7B || 129 123 || 1060 311 || HTTP errorConverted from [https: //developer.mozilla.org/en-US/docs/Mozilla/Projects/NSS/SSL_functions/sslerr.html NSS] SSL CA certerrors: -12261 (SSL_ERROR_RX_MALFORMED_HELLO_REQUEST), -12260 (SSL_ERROR_RX_MALFORMED_CLIENT_HELLO), -12259 (SSL_ERROR_RX_MALFORMED_SERVER_HELLO), -12258 (SSL_ERROR_RX_MALFORMED_CERTIFICATE), -12257 (SSL_ERROR_RX_MALFORMED_SERVER_KEY_EXCH), -12256 (SSL_ERROR_RX_MALFORMED_CERT_REQUEST), -12255 (SSL_ERROR_RX_MALFORMED_HELLO_DONE), -12254 (SSL_ERROR_RX_MALFORMED_CERT_VERIFY), -12253 (SSL_ERROR_RX_MALFORMED_CLIENT_KEY_EXCH), -12252 (SSL_ERROR_RX_MALFORMED_FINISHED), -12251 (SSL_ERROR_RX_MALFORMED_CHANGE_CIPHER), -12250 (SSL_ERROR_RX_MALFORMED_ALERT), -12249 (SSL_ERROR_RX_MALFORMED_HANDSHAKE), -12248 (SSL_ERROR_RX_MALFORMED_APPLICATION_DATA), -12166 (SSL_ERROR_RX_MALFORMED_HELLO_VERIFY_REQUEST).
|-
| 0x12C081 0x2707B || 129 123 || 2400 312 || Server Converted from [https://developer.mozilla.org/en-US/docs/Mozilla/Projects/NSS/SSL_functions/sslerr.html NSS] SEC error-8144 (SEC_ERROR_UNSUPPORTED_KEYALG). Also converted from [https://developer.mozilla.org/en-US/docs/Mozilla/Projects/NSS/SSL_functions/sslerr.html NSS] SSL errors: Status 400-12274 (SSL_ERROR_SSL2_DISABLED), -12247 (SSL_ERROR_RX_UNEXPECTED_HELLO_REQUEST), -12246 (SSL_ERROR_RX_UNEXPECTED_CLIENT_HELLO), -12245 (SSL_ERROR_RX_UNEXPECTED_SERVER_HELLO), -12244 (SSL_ERROR_RX_UNEXPECTED_CERTIFICATE), -12243 (SSL_ERROR_RX_UNEXPECTED_SERVER_KEY_EXCH), -12242 (SSL_ERROR_RX_UNEXPECTED_CERT_REQUEST), -12241 (SSL_ERROR_RX_UNEXPECTED_HELLO_DONE), -12240 (SSL_ERROR_RX_UNEXPECTED_CERT_VERIFY), -12239 (SSL_ERROR_RX_UNEXPECTED_CLIENT_KEY_EXCH), -12238 (SSL_ERROR_RX_UNEXPECTED_FINISHED).
|-
| 0x12C281 0x2727B || 129 123 || 2401 313 || Server errorConverted from [https: Status 401//developer.mozilla.org/en-US/docs/Mozilla/Projects/NSS/SSL_functions/sslerr.html NSS] SSL errors: -12237 (SSL_ERROR_RX_UNEXPECTED_CHANGE_CIPHER), -12236 (SSL_ERROR_RX_UNEXPECTED_ALERT), -12235 (SSL_ERROR_RX_UNEXPECTED_HANDSHAKE), -12234 (SSL_ERROR_RX_UNEXPECTED_APPLICATION_DATA).
|-
| 0x12C681 0x2747B || 129 123 || 2403 314 || Server Converted from [https://developer.mozilla.org/en-US/docs/Mozilla/Projects/NSS/SSL_functions/sslerr.html NSS] SSL error: Status 403-12263 (SSL_ERROR_RX_RECORD_TOO_LONG).
|-
| 0x138881 0x2767B || 129 123 || 2500 315 || Server Converted from [https://developer.mozilla.org/en-US/docs/Mozilla/Projects/NSS/SSL_functions/sslerr.html NSS] SSL error: Status 500-12165 (SSL_ERROR_RX_UNEXPECTED_HELLO_VERIFY_REQUEST).
|-
| 0x138E81 0x2787B || 129 123 || 2503 316 || Server Converted from [https://developer.mozilla.org/en-US/docs/Mozilla/Projects/NSS/SSL_functions/sslerr.html NSS] SSL error: Status 503-12163 (SSL_ERROR_RX_UNEXPECTED_CERT_STATUS).
|-
| 0x139081 0x27A7B || 129 123 || 2504 317 || Server Converted from [https://developer.mozilla.org/en-US/docs/Mozilla/Projects/NSS/SSL_functions/sslerr.html NSS] SSL error: Status 504-12160 (SSL_ERROR_INCORRECT_SIGNATURE_ALGORITHM).
|-
| 0xA83 0x27C7B || 131 123 || 5 318 || Unrecognized applet IDConverted from [https://developer.mozilla.org/en-US/docs/Mozilla/Projects/NSS/SSL_functions/sslerr.html NSS] SSL errors: -12173 (SSL_ERROR_WEAK_SERVER_EPHEMERAL_DH_KEY), -12156 (SSL_ERROR_WEAK_SERVER_CERT_KEY).
|-
| 0x485 0x27E7B || 133 123 || 2 319 || Invalid DVFS table IDConverted from [https://developer.mozilla.org/en-US/docs/Mozilla/Projects/NSS/SSL_functions/sslerr.html NSS] SSL error -12273 (SSL_ERROR_BAD_MAC_READ).
|-
| 0x885 0x2827B || 133 123 || 4 321 || Invalid parameterConverted from [https://developer.mozilla.org/en-US/docs/Mozilla/Projects/NSS/SSL_functions/sslerr.html NSS] SSL errors: -12215 (SSL_ERROR_MD5_DIGEST_FAILURE), -12214 (SSL_ERROR_SHA_DIGEST_FAILURE), -12161 (SSL_ERROR_DIGEST_FAILURE).
|-
| 0x1489 0x2847B || 137 123 || 10 322 || Already initializedConverted from [https://developer.mozilla.org/en-US/docs/Mozilla/Projects/NSS/SSL_functions/sslerr.html NSS] SSL error -12213 (SSL_ERROR_MAC_COMPUTATION_FAILURE).
|-
| 0x3C89 0x2887B || 137 123 || 30 324 || Task not foundConverted from [https://developer.mozilla.org/en-US/docs/Mozilla/Projects/NSS/SSL_functions/sslerr.html NSS] SEC error -8157 (SEC_ERROR_EXTENSION_NOT_FOUND).
|-
| 0x5089 0x28A7B || 137 123 || 40 325 || Memory allocation failed Converted from [https:/ bad input/developer.mozilla.org/en-US/docs/Mozilla/Projects/NSS/SSL_functions/sslerr.html NSS] SEC error -8049 (SEC_ERROR_UNRECOGNIZED_OID).
|-
| 0x29489 0x28C7B || 137 123 || 330 326 || Converted from [[NCM_services#ContentMetaType|ContentMetaType]https://developer.mozilla.org/en-US/docs/Mozilla/Projects/NSS/SSL_functions/sslerr.html NSS] doesn't match SystemUpdateSEC error -8032 (SEC_ERROR_POLICY_VALIDATION_FAILED).
|-
| 0x271289 0x2947B || 137 123 || 5001 330 || One of the following socket errors occurredConverted from [https: ENETDOWN, ECONNRESET, EHOSTDOWN, EHOSTUNREACH, or EPIPE//developer. Also occurs when the received size doesn't match the expected size (recvfrommozilla.org/en-US/docs/Mozilla/Projects/NSS/SSL_functions/sslerr.html NSS] SSL error -12177 () ret with [[NIM_services#Contents_Delivery|meta_size]] data receivingSSL_ERROR_DECOMPRESSION_FAILURE).
|-
| 0x272489 0xBBA7B || 137 123 || 5010 1501 || Socket was Converted from [[Sockets_services|shutdownhttps://developer.mozilla.org/en-US/docs/Mozilla/Projects/NSS/SSL_functions/sslerr.html NSS] SSL error -12230 (SSL_ERROR_CLOSE_NOTIFY_ALERT)]] due to the async operation being cancelled.
|-
| 0x273889 0xBBC7B || 137 123 || 5020 1502 || Too many internal output entries with Converted from [[NIM_services|nim]] cmd42, system is [[NIM_services#Contents_Delivery|Internethttps://developer.mozilla.org/en-connected]US/docs/Mozilla/Projects/NSS/SSL_functions/sslerr.html NSS], or an unrecognized socket SSL error occured-12229 (SSL_ERROR_HANDSHAKE_UNEXPECTED_ALERT).
|-
| 0x27D889 0xBBE7B || 137 123 || 5100 1503 || Connection timeoutConverted from [https://developer.mozilla.org/en-US/docs/Mozilla/Projects/NSS/SSL_functions/sslerr.html NSS] SSL error -12272 (SSL_ERROR_BAD_MAC_ALERT).
|-
| 0x2A4489 0xBC07B || 137 123 || 5410 1504 || Invalid Converted from [[NIM_services#Contents_Delivery|ID]https://developer.mozilla.org/en-US/docs/Mozilla/Projects/NSS/SSL_functions/sslerr.html NSS]SSL error -12197 (SSL_ERROR_DECRYPTION_FAILED_ALERT).
|-
| 0x2A5889 0xBC27B || 137 123 || 5420 1505 || Invalid Converted from [[NIM_services#Contents_Delivery|magicnumhttps://developer.mozilla.org/en-US/docs/Mozilla/Projects/NSS/SSL_functions/sslerr.html NSS]]. Can also be caused by the connection being closed by the peer, since nonSSL error -negative return values from recv12196 (SSL_ERROR_RECORD_OVERFLOW_ALERT) are ignored in this case.
|-
| 0x2A6C89 0xBC47B || 137 123 || 5430 1506 || Invalid Converted from [[NIM_services#Contents_Delivery|data_size]https://developer.mozilla.org/en-US/docs/Mozilla/Projects/NSS/SSL_functions/sslerr.html NSS]SSL error -12228 (SSL_ERROR_DECOMPRESSION_FAILURE_ALERT).
|-
| 0x2A8089 0xBC67B || 137 123 || 5440 1507 || The input Converted from [[NCM_services#ContentMetaKey|ContentMetaKey]https://developer.mozilla.org/en-US/docs/Mozilla/Projects/NSS/SSL_functions/sslerr.html NSS] doesn't match the ContentMetaKey in stateSSL error -12227 (SSL_ERROR_HANDSHAKE_FAILURE_ALERT).
|-
| 0x2A9489 0xBCA7B || 137 123 || 5450 1509 || Invalid Converted from [[NIM_services#Contents_Delivery|meta_size]https://developer.mozilla.org/en-US/docs/Mozilla/Projects/NSS/SSL_functions/sslerr.html NSS]SSL error -12271 (SSL_ERROR_BAD_CERT_ALERT).
|-
| 0x36B289 0xBCC7B || 137 123 || 7001 1510 || HTTP invalid response code Converted from [https://developer.mozilla.org/en-US/docs/Mozilla/Projects/NSS/SSL_functions/sslerr.html NSS] SSL error -12225 (>=600SSL_ERROR_UNSUPPORTED_CERT_ALERT).
|-
| 0x36B489 0xBCE7B || 137 123 || 7002 1511 || HTTP invalid client response code Converted from [https://developer.mozilla.org/en-US/docs/Mozilla/Projects/NSS/SSL_functions/sslerr.html NSS] SSL error -12270 (4xxSSL_ERROR_REVOKED_CERT_ALERT).
|-
| 0x36B689 0xBD07B || 137 123 || 7003 1512 || HTTP invalid server response code Converted from [https://developer.mozilla.org/en-US/docs/Mozilla/Projects/NSS/SSL_functions/sslerr.html NSS] SSL error -12269 (5xxSSL_ERROR_EXPIRED_CERT_ALERT).
|-
| 0x36B889 0xBD27B || 137 123 || 7004 1513 || HTTP invalid redirect response code Converted from [https://developer.mozilla.org/en-US/docs/Mozilla/Projects/NSS/SSL_functions/sslerr.html NSS] SSL error -12224 (3xxSSL_ERROR_CERTIFICATE_UNKNOWN_ALERT).
|-
| 0x390889-0x391889 0xBD47B || 137 123 || 7300-7308 1514 || HTTP response code 300Converted from [https://developer.mozilla.org/en-US/docs/Mozilla/Projects/NSS/SSL_functions/sslerr.html NSS] SSL error -30812226 (SSL_ERROR_ILLEGAL_PARAMETER_ALERT).
|-
| 0x39D089-0x39F289 0xBD67B || 137 123 || 7400-7417 1515 || HTTP response code 400Converted from [https://developer.mozilla.org/en-US/docs/Mozilla/Projects/NSS/SSL_functions/sslerr.html NSS] SSL error -41712195 (SSL_ERROR_UNKNOWN_CA_ALERT).
|-
| 0x3A9889-0x3AAA89 0xBD87B || 137 123 || 7500-7509 1516 || HTTP response code 500Converted from [https://developer.mozilla.org/en-US/docs/Mozilla/Projects/NSS/SSL_functions/sslerr.html NSS] SSL error -50912194 (SSL_ERROR_ACCESS_DENIED_ALERT).
|-
| 0x3CF089 0xBDA7B || 137 123 || 7800 1517 || UnknownConverted from [https:/invalid libcurl /developer.mozilla.org/en-US/docs/Mozilla/Projects/NSS/SSL_functions/sslerr.html NSS] SSL error-12193 (SSL_ERROR_DECODE_ERROR_ALERT).
|-
| 0x3E8289-0x3F4089 0xBDC7B || 137 123 || 8001-8096 1518 || libcurl error 1Converted from [https://developer.mozilla.org/en-96US/docs/Mozilla/Projects/NSS/SSL_functions/sslerr. Some of the libcurl errors in the html NSS] SSL error-table map to the above unknown-libcurl-error however12192 (SSL_ERROR_DECRYPT_ERROR_ALERT).
|-
| 0x68A 0xBDE7B || 138 123 || 3 1519 || Not initializedConverted from [https://developer.mozilla.org/en-US/docs/Mozilla/Projects/NSS/SSL_functions/sslerr.html NSS] SSL error -12191 (SSL_ERROR_EXPORT_RESTRICTION_ALERT).
|-
| 0x668C 0xBE07B || 140 123 || 51 1520 || USB dataConverted from [https://developer.mozilla.org/en-transfer in progressUS/docs/Mozilla/Projects/NSS/SSL_functions/sslerr.html NSS] SSL error -12190 (SSL_ERROR_PROTOCOL_VERSION_ALERT).
|-
| 0xD48C 0xBE27B || 140 123 || 106 1521 || Invalid descriptorConverted from [https://developer.mozilla.org/en-US/docs/Mozilla/Projects/NSS/SSL_functions/sslerr.html NSS] SSL error -12189 (SSL_ERROR_INSUFFICIENT_SECURITY_ALERT).
|-
| 0x1928C 0xBE47B || 140 123 || 201 1522 || USB device not bound Converted from [https:/ interface already enabled/developer.mozilla.org/en-US/docs/Mozilla/Projects/NSS/SSL_functions/sslerr.html NSS] SSL error -12188 (SSL_ERROR_INTERNAL_ERROR_ALERT).
|-
| 0x1BE8E 0xBE67B || 142 123 || 223 1523 || [[Network_Interface_services#IsAnyInternetRequestAccepted|IsAnyInternetRequestAccepted]] with the output Converted from [[#Network_Interface_services#GetClientId|GetClientId]https://developer.mozilla.org/en-US/docs/Mozilla/Projects/NSS/SSL_functions/sslerr.html NSS] returned falseSSL error -12157 (SSL_ERROR_INAPPROPRIATE_FALLBACK_ALERT).
|-
| 0x290 0xBE87B || 144 123 || 1 1524 || Exited Abnormally (Converted from [[Applet_Manager_services#LibraryAppletExitReason|ExitReasonhttps://developer.mozilla.org/en-US/docs/Mozilla/Projects/NSS/SSL_functions/sslerr.html NSS]] == AbormalSSL error -12187 (SSL_ERROR_USER_CANCELED_ALERT).
|-
| 0x690 0xBEA7B || 144 123 || 3 1525 || Canceled (Converted from [[Applet_Manager_services#LibraryAppletExitReason|ExitReasonhttps://developer.mozilla.org/en-US/docs/Mozilla/Projects/NSS/SSL_functions/sslerr.html NSS]] == CanceledSSL error -12186 (SSL_ERROR_NO_RENEGOTIATION_ALERT).
|-
| 0x890 0xBEC7B || 144 123 || 4 1526 || RejectedConverted from [https://developer.mozilla.org/en-US/docs/Mozilla/Projects/NSS/SSL_functions/sslerr.html NSS] SSL error -12184 (SSL_ERROR_UNSUPPORTED_EXTENSION_ALERT).
|-
| 0xA90 0xBEE7B || 144 123 || 5 1527 || Exited Unexpectedly (Converted from [[Applet_Manager_services#LibraryAppletExitReason|ExitReasonhttps://developer.mozilla.org/en-US/docs/Mozilla/Projects/NSS/SSL_functions/sslerr.html NSS]] == UnexpectedSSL error -12183 (SSL_ERROR_CERTIFICATE_UNOBTAINABLE_ALERT).
|-
| 0x299 0xBF07B || 153 123 || 1 1528 || Invalid audio deviceConverted from [https://developer.mozilla.org/en-US/docs/Mozilla/Projects/NSS/SSL_functions/sslerr.html NSS] SSL error -12182 (SSL_ERROR_UNRECOGNIZED_NAME_ALERT).
|-
| 0x499 0xBF27B || 153 123 || 2 1529 || Operation couldn't complete successfullyConverted from [https://developer.mozilla.org/en-US/docs/Mozilla/Projects/NSS/SSL_functions/sslerr.html NSS] SSL error -12181 (SSL_ERROR_BAD_CERT_STATUS_RESPONSE_ALERT).
|-
| 0x699 0xBF47B || 153 123 || 3 1530 || Invalid sample rateConverted from [https://developer.mozilla.org/en-US/docs/Mozilla/Projects/NSS/SSL_functions/sslerr.html NSS] SSL error -12180 (SSL_ERROR_BAD_CERT_HASH_VALUE_ALERT).
|-
| 0x899 0x27127B || 153 123 || 4 5001 || Buffer size too smallConverted from [https://developer.mozilla.org/en-US/docs/Mozilla/Projects/NSS/SSL_functions/sslerr.html NSS] SSL error -12155 (SSL_ERROR_RX_SHORT_DTLS_READ).
|-
| 0x1099 0x271E7B || 153 123 || 8 5007 || Too many buffers are still unreleasedOut-of-bounds error during error conversion.
|-
| 0x1499 0x287C || 153 124 || 10 20 || Invalid channel countArgument is NULL
|-
| 0x40299 0x2C7C || 153 124 || 513 22 || Invalid/Unsupported operationArgument is invalid
|-
| 0xC0099 0x3C7C || 153 124 || 1536 30 || Invalid handleBad input buffer size
|-
| 0xC0899 0x407C || 153 124 || 1540 32 || Audio output was already startedInvalid input buffer
|-
| 0x3C9D 0x767C || 157 124 || 30 59 || Address is NULL[[Network_Interface_services#IsAnyInternetRequestAccepted|IsAnyInternetRequestAccepted]] with the output from [[#Network_Interface_services#GetClientId|GetClientId]] returned false.
|-
| 0x3E9D 0x17707C || 157 124 || 31 3000 || PID is NULL[https://en-americas-support.nintendo.com/app/answers/detail/a_id/27166/ System Update Required]
|-
| 0x549D 0x17727C || 157 124 || 42 3001 || Already bound[https://en-americas-support.nintendo.com/app/answers/detail/a_id/28969/ Game Update Required]
|-
| 0xCC9D 0x1F4E7C || 157 124 || 102 4007 || Invalid PID[https://en-americas-support.nintendo.com/app/answers/detail/a_id/28046/ Account Permanent Ban]
|-
| 0x49E 0x23387C || 158 124 || 2 4508 || BootImagePackage not found[https://en-americas-support.nintendo.com/app/answers/detail/a_id/28046/ Account Permanent Ban]
|-
| 0x69E 0x234A7C || 158 124 || 3 4517 || Invalid BootImagePackage[https://en-americas-support.nintendo.com/app/answers/detail/a_id/43652/ Account Ban]
|-
| 0x89E 0x24027C || 158 124 || 4 4609 || Work buffer too small[https://en-americas-support.nintendo.com/app/answers/detail/a_id/46482/ Service Discontinued]
|-
| 0xA9E 0x27E || 158 126 || 5 1 || Work buffer not alignedInvalid argument
|-
| 0xC9E 0x87E || 158 126 || 6 4 || BootImages need repairEntry not found
|-
| 0xAA3 0xCE7E || 163 126 || 5 67 || System is booting up repair process without VOL+ held down.Invalid database signature value (should be "NFDB")
|-
| 0xCA3 0xD27E || 163 126 || 6 69 || System is booting up repair process that requires RepairTimeReviser but does not have special cartridge inserted.Invalid database entry count
|-
| 0x70A4 0x1987E || 164 126 || 56 204 || [[Network_Interface_services#IsAnyInternetRequestAccepted|IsAnyInternetRequestAccepted]] with the output from [[#Network_Interface_services#GetClientId|GetClientId]] returned false.Development/debug-only behavior
|-
| 0x4AF 0x480 || 175 128 || 2 || Bad version returned from calling the "nnjitpluginGetVersion" symbolIStorage not available.
|-
| 0xCAAF 0x680 || 175 128 || 101 3 || Input NRO/NRR are too large for the storage buffer.No messages
|-
| 0x4B0AF 0x4680 || 175 128 || 600 35 || Symbol funcptr used by this cmd is not initialized (Control/GenerateCode)Error while launching applet.
|-
| 0x4B2AF 0x4A80 || 175 128 || 601 37 || DllPlugin Not initialized, or plugin NRO has already been loadedTitle-ID not found.Caused by code 0x410 when applet launch fails
|-
| 0x4B4AF 0x3E880 || 175 128 || 602 500 || An error was returned from calling the symbol funcptr with the Control cmd.Invalid input
|-
| 0xC8B2 0x3EC80 || 178 128 || 100 502 || Invalid user IDIStorage has already been opened by another accessor
|-
| 0xCAB2 0x3EE80 || 178 128 || 101 503 || User does not existIStorage Read/Write out-of-bounds
|-
| 0x12CB2 0x3F480 || 178 128 || 150 506 || Service unavailableInvalid parameters
|-
| 0x190B2 0x3FE80 || 178 128 || 200 511 || File storage failureIStorage opened as wrong type (data opened as transfermem, transfermem opened as data)
|-
| 0xAB4 0x40080 || 180 128 || 5 512 || Invalid event IDUnbalanced fatal section leave (returned when executing LeaveFatalSection without a preceding EnterFatalSection call)
|-
| 0x1F4EB5 0x40C80 || 181 128 || 4007 518 || Device authentication error: System update requiredNull object
|-
| 0x1F50B5 0x4B080 || 181 128 || 4008 600 || Device authentication error: BannedFailed to allocate memory for IStorage
|-
| 0x1F52B5 0x59080 || 181 128 || 4009 712 || Device authentication error: Internal server errorThread stack pool exhausted (out of memory)
|-
| 0x1F54B5 0x79C80 || 181 128 || 4007 974 || Device authentication error: Under maintenanceDebugMode not enabled
|-
| 0x58ACA 0x7A880 || 202 128 || 709 980 || Npad ID is out of range<code>am.debug!dev_function</code> setting needs to be set / DebugMode not enabled
|-
| 0x2032CA 0x7CC80 || 202 128 || 4121 998 || [[Settings_services#ButtonConfigSettings|ButtonConfigSettings]] IsFull flag is clear.Not implemented
|-
| 0xF0CD 0xCC81 || 205 129 || 120 102 || IR image data Transmission not available/ready.agreed
|-
| 0x1A8CD 0xD281 || 205 129 || 212 105 || IR camera handle pointer is null.Network unavailable
|-
| 0x198CD 0x7DA81 || 205 129 || 204 1005 || IR camera invalid handle value.HTTP error: Couldnt resolve proxy
|-
| 0x4CE 0x7DC81 || 206 129 || 2 1006 || Invalid argument.HTTP error: Couldnt resolve host
|-
| 0x6CE 0x7DE81 || 206 129 || 3 1007 || Out of memory.HTTP error: Couldnt connect
|-
| 0x10CE 0x7FE81 || 206 129 || 8 1023 || Out of range. Buffer needs to be aligned.HTTP error: Write error
|-
| 0x18CE 0x80481 || 206 129 || 12 1026 || Invalid FileId.HTTP error: Read error
|-
| 0x1ACE 0x80681 || 206 129 || 13 1027 || Invalid storage ID.HTTP error: Out of memory
|-
| 0x1CCE 0x80881 || 206 129 || 14 1028 || Invalid content type.HTTP error: Operation timedout
|-
| 0x2ACE 0x81681 || 206 129 || 21 1035 || Failed to mount Image Directory.HTTP error: SSL connect error
|-
| 0x2CCE 0x83681 || 206 129 || 23 1051 || File too big.HTTP error: Peer failed verification
|-
| 0x30CE 0x83881 || 206 129 || 24 1052 || Invalid file size.HTTP error: Got nothing
|-
| 0x3CCE 0x83E81 || 206 129 || 30 1055 || Buffer insufficient.HTTP error: Send error
|-
| 0xAF2CE 0x84081 || 206 129 || 1401 1056 || Too many files already saved.HTTP error: Recv error
|-
| 0x4DA 0x84481 || 218 129 || 2 1058 || StatusManager entry IsValid flag not set, or controller-update currently in-progress.HTTP error: SSL cert problem
|-
| 0x6DA 0x84681 || 218 129 || 3 1059 || Controller-update failed via the LibraryApplet.HTTP error: SSL cipher
|-
| 0x8DA 0x84881 || 218 129 || 4 1060 || Invalid BusHandle.HTTP error: SSL CA cert
|-
| 0xADA 0x12C081 || 218 129 || 5 2400 || StatusManager entry flag +0x0 not set, or device not connected.Server error: Status 400
|-
| 0xEDA 0x12C281 || 218 129 || 7 2401 || PollingReceivedData not available.Server error: Status 401
|-
| 0x10DA 0x12C681 || 218 129 || 8 2403 || StatusManager entry DeviceEnabled flag not set, or flag +0x0 not set.Server error: Status 403
|-
| 0x12DA 0x138881 || 218 129 || 9 2500 || ExternalDeviceId mismatch.Server error: Status 500
|-
| 0x14DA 0x138E81 || 218 129 || 10 2503 || BusHandle already initialized.|} === FS Error codes ===The following are the Server error codes recognized by nn::fs::detail::LogErrorMessage found in some [[Factory Setup|factory]] titles: {| class=wikitable! Value || Description || MessageStatus 503
|-
| 0xD401 0x139081 || 106 129 || nn::svc::ResultInvalidCurrentMemory: Error2504 || Server error: Passed buffer is not usable for fs library. See a manual of fs library for more information.Status 504
|-
| 0x7802 0xA83 || 60 131 || nn::fs::ResultMountNameAlreadyExists: Error: Specified mount name already exists.5 || Unrecognized applet ID
|-
| 0x7D202 0x485 || 1001 133 || nn::fs::ResultPartitionNotFound: Error: Specified partition is not found.2 || Invalid DVFS table ID
|-
| 0x7D402 0x685 || 1002 133 || nn::fs::ResultTargetNotFound: Error: Specified target is not found3 || DVFS table ID for debug only, see [[PCV_services#Module|DVFS Table]] notes.
|-
| 0xFA002 - 0x138602 0x885 || 2000 - 2499 133 || nn::fs::ResultSdCardAccessFailed: Error: Failed to access SD card.4 || Invalid parameter
|-
| 0x136802 - 0x176E02 0x1489 || 2500 - 2999 137 || nn::fs::ResultGameCardAccessFailed: Error: Failed to access game card10 || Already initialized.
|-
| 0x177202 0x3C89 || 3001 137 || nn::fs::ResultNotImplemented: Error: Specified operation is 30 || Task not implementedfound.
|-
| 0x177A02 0x5089 || 3005 137 || nn::fs::ResultOutOfRange: Error: Specified value is out of range40 || Memory allocation failed / bad input.
|-
| 0x190002 - 0x1B5602 0x29489 || 3200 - 3499 137 || nn::fs::ResultAllocationMemoryFailed: Error: Failed to allocate memory330 || [[NCM_services#ContentMetaType|ContentMetaType]] doesn't match SystemUpdate.
|-
| 0x1B5802 - 0x1F3E02 0x271289 || 3500 - 3999 137 || nn5001 || One of the following socket errors occurred::fs::ResultMmcAccessFailed: Error: Failed to access MMCENETDOWN, ECONNRESET, EHOSTDOWN, EHOSTUNREACH, or EPIPE. Also occurs when the received size doesn't match the expected size (recvfrom() ret with [[NIM_services#Contents_Delivery|meta_size]] data receiving).
|-
| 0x1F4202 - 0x219602 0x272489 || 4001 - 4299 137 || nn::fs::ResultRomCorrupted: Error: ROM is corrupted5010 || Socket was [[Sockets_services|shutdown()]] due to the async operation being cancelled.
|-
| 0x219A02 - 0x232602 0x273889 || 137 ||5020 | 4301 - 4499 |Too many internal output entries with [[NIM_services| nn::fs::ResultSaveDataCorrupted: Error: Save data nim]] cmd42, system is corrupted[[NIM_services#Contents_Delivery|Internet-connected]], or an unrecognized socket error occured.
|-
| 0x232A02 - 0x23EE02 0x27D889 || 4501 - 4599 137 || nn::fs::ResultNcaCorrupted: Error: NCA is corrupted5100 || Connection timeout.
|-
| 0x23F202 - 0x243E02 0x2A4489 || 4601 - 4639 137 || nn::fs::ResultIntegrityVerificationStorageCorrupted: Error: Integrity verification failed5410 || Invalid [[NIM_services#Contents_Delivery|ID]].
|-
| 0x244202 - 0x246602 0x2A5889 || 137 ||5420 | 4641 - 4659 |Invalid [[NIM_services#Contents_Delivery| nn::fs::ResultPartitionFileSystemCorrupted: Error: Partition FS is corruptedmagicnum]]. Can also be caused by the connection being closed by the peer, since non-negative return values from recv() are ignored in this case.
|-
| 0x246A02 - 0x248E02 0x2A6C89 || 4661 - 4679 137 || nn::fs::ResultBuiltInStorageCorrupted: Error: Built-in-storage is corrupted5430 || Invalid [[NIM_services#Contents_Delivery|data_size]].
|-
| 0x249202 - 0x24B602 0x2A8089 || 4681 - 4699 137 || nn::fs::ResultFatFileSystemCorrupted: Error: FAT FS is corrupted5440 || The input [[NCM_services#ContentMetaKey|ContentMetaKey]] doesn't match the ContentMetaKey in state.
|-
| 0x24BA02 - 0x24DE02 0x2A9489 || 4701 - 4719 137 || nn::fs::ResultHostFileSystemCorrupted: Error: HOST FS is corrupted5450 || Invalid [[NIM_services#Contents_Delivery|meta_size]].
|-
| 0x1F4002 - 0x270E02 0x36B289 || 4000, 4300, 4500, 4600, 4640, 4660, 4680, 4700, 4720-4999 137 || nn::fs::ResultDataCorrupted: Error: Data is corrupted7001 || HTTP invalid response code (>=600).
|-
| 0x271002 - 0x2EDE02 0x36B489 || 5000-5999 137 || nn::fs::ResultUnexpected: Error: Unexpected failure occurred7002 || HTTP invalid client response code (4xx).
|-
| 0x2EE002 - 0x32C602 0x36B689 || 6000-6499 137 || nn::fs::ResultPreconditionViolation: Error: Precondition violation7003 || HTTP invalid server response code (5xx).
|-
| 0x2EE202 - 0x306E02 0x36B889 || 6001-6199 137 || nn::fs::ResultInvalidArgument: Error: Invalid argument was specified7004 || HTTP invalid redirect response code (3xx).
|-
| 0x2EE402 0x390889- 0x2F1A02 0x391889 || 6002137 || 7300-6029 7308 || nn::fs::ResultInvalidPath: Error: Invalid path was specifiedHTTP response code 300-308.
|-
| 0x2EE602 0x39D089-0x39F289 || 6003 137 || nn::fs::ResultTooLongPath: Error: Too long path was specified7400-7417 || HTTP response code 400-417.
|-
| 0x2EE802 0x3A9889-0x3AAA89 || 6004 137 || nn::fs::ResultInvalidCharacter: Error: Invalid path character was specified7500-7509 || HTTP response code 500-509.
|-
| 0x2EEA02 0x3CF089 || 6005 137 || nn::fs::ResultInvalidPathFormat: Error: Invalid path format was specified7800 || Unknown/invalid libcurl error.
|-
| 0x2F5A02 0x3E8289-0x3F4089 || 6061 137 || nn::fs::ResultInvalidOffset: Error: Invalid offset was specified8001-8096 || libcurl error 1-96. Some of the libcurl errors in the error-table map to the above unknown-libcurl-error however.
|-
| 0x2F5C02 0x68A || 6062 138 || nn::fs::ResultInvalidSize: Error: Invalid size was specified3 || Not initialized.
|-
| 0x2F5E02 0x668C || 6063 140 || nn::fs::ResultNullptrArgument: Error: Null pointer argument was specified.51 || USB data-transfer in progress
|-
| 0x2F6202 0xD48C || 6065 140 || 106 || nn::fs::ResultInvalidMountName: Error: Invalid mount name was specified.descriptor
|-
| 0x2F6402 0x1928C || 6066 140 || nn::fs::ResultExtensionSizeTooLarge: Error: Extension size exceeds max value set in nmeta file201 || USB device not bound / interface already enabled|-| 0x1BE8E || 142 || 223 || [[Network_Interface_services#IsAnyInternetRequestAccepted|IsAnyInternetRequestAccepted]] with the output from [[#Network_Interface_services#GetClientId|GetClientId]] returned false.
|-
| 0x2F6602 0x290 || 6067 144 || nn::fs::ResultExtensionSizeInvalid: Error: Extension size is not a multiple of nn::fs::SaveDataExtensionUnitSize.1 || Exited Abnormally ([[Applet_Manager_services#LibraryAppletExitReason|ExitReason]] == Abormal)
|-
| 0x307202 0x690 || 6201 144 || nn::fs::ResultFileExtensionWithoutOpenModeAllowAppend: Error: OpenMode_AllowAppend is required for implicit extension of file size by WriteFile3 || Canceled ([[Applet_Manager_services#LibraryAppletExitReason|ExitReason]] == Canceled).
|-
| 0x307002 - 0x313602 0x890 || 6200, 6202 - 6299 144 || nn::fs::ResultInvalidOperationForOpenMode: Error: Invalid operation for the open mode.4 || Rejected
|-
| 0x313802 - 0x31FE02 0xA90 || 6300-6399 144 || nn::fs::ResultUnsupportedOperation: Error: Unsupported operation.5 || Exited Unexpectedly ([[Applet_Manager_services#LibraryAppletExitReason|ExitReason]] == Unexpected)
|-
| 0x320002 - 0x326202 0x293 || 6400-6449 147 || nn::fs::ResultPermissionDenied: Error: Permission denied.1 || NotInitialized
|-
| 0x327202 0x493 || 6457 147 || nn::fs::ResultWriteModeFileNotClosed: Error: Close files opened in write mode before committing.2 || AlreadyInitialized
|-
| 0x328202 0x693 || 6465 147 || nn::fs::ResultUserNotExist: Error: Specified user doesn't exist.3 || OutOfArraySpace
|-
| 0x346402 0x893 || 6706 147 || nn::fs::ResultMappingTableFull: Error: Enough journal space is not left.4 || OutOfFieldSpace
|-
| 0x346A02 0xA93 || 6709 147 || nn::fs::ResultOpenCountLimit: Error: The open count of files and directories reached the limitation.5 || OutOfMemory
|-
| 0x353602 0xC93 || 6811 147 || nn::fs::ResultMapFull: Error: Save data extension count reached the limitation.6 || NotSupported
|-
| 0x35F202 0xE93 || 6905 147 || nn::fs::ResultNotMounted: Error: Specified mount name is not found.7 |} = Fatal Errors ={| class=wikitable! Error || DescriptionInvalidArgument
|-
| 2162-00020x1093 | Can be triggered by running [[SVC|svcBreak]]. The svcBreak params have no effect on the value of the thrown error-code.147 || 8 || NotFound
|-
| 2168-00000x1293 | Userland ARM undefined instruction exception| 147 || 9 || FieldCategoryMismatch
|-
| 2168-00010x1493 | Userland ARM prefetch-abort due to PC set to non-executable region| 147 || 10 || FieldTypeMismatch
|-
| 21680x1693 || 147 || 11 || AlreadyExists|-| 0x1893 || 147 || 12 || CorruptJournal|-| 0x1A93 || 147 || 13 || CategoryNotFound|-| 0x1C93 || 147 || 14 || RequiredContextMissing|-0002| Userland ARM data abort. Also caused by abnormal process termination via [[SVC0x1E93 || 147 || 15 || RequiredFieldMissing|svcExitProcess]]. Note: directly jumping to nnMain()-retaddr from non| 0x2093 || 147 || 16 || FormatterError|-main| 0x2293 || 147 || 17 || InvalidPowerState|-thread has the same result.| 0x2493 || 147 || 18 || ArrayFieldTooLarge
|-
| 2168-00030x2693 | Userland PC address not aligned to 4 bytes| 147 || 19 || AlreadyOwned
|-
| 2168-00080x299 | Can occur when attempting to call an svc outside the whitelist|} = Support Errors =This section is for Support Errors displayed by the error-applet, separate from the normal Result Errors. == Modules =={153 | class=wikitable! Value |1 | Name| Invalid audio device
|-
| 520 0x499 || NVIDIA Error Report (nverpt)153 || 2 || Operation couldn't complete successfully
|-
| 800 0x699 || [[Internet_Browser153 |General web-applet]]| 3 || Invalid sample rate
|-
| 809 0x899 || [[Internet_Browser153 |WifiWebAuthApplet]]| 4 || Buffer size too small
|-
| 0x1099 || 153 || 8 || Too many buffers are still unreleased|-| 0x1499 || 153 || 10 || Invalid channel count|-| 0x40299 || 153 || 513 || Invalid/Unsupported operation|-| 0xC0099 || 153 || 1536 || Invalid handle|-| 0xC0899 || 153 || 1540 || Audio output was already started|-| 0x3C9D || 157 || 30 || Address is NULL|-| 0x3E9D || 157 || 31 || PID is NULL|-| 0x549D || 157 || 42 || Already bound|-| 0xCC9D || 157 || 102 || Invalid PID|-| 0x49E || 158 || 2 || BootImagePackage not found|-| 0x69E || 158 || 3 || Invalid BootImagePackage|-| 0x89E || 158 || 4 || Work buffer too small|-| 0xA9E || 158 || 5 || Work buffer not aligned|-| 0xC9E || 158 || 6 || BootImages need repair|-| 0x29F || 159 || 1 || Cancel was selected|-| 0xAA3 || 163 || 5 || System is booting up repair process without VOL+ held down.|-| 0xCA3 || 163 || 6 || System is booting up repair process that requires RepairTimeReviser but does not have special cartridge inserted.|-| 0x70A4 || 164 || 56 || [[Network_Interface_services#IsAnyInternetRequestAccepted|IsAnyInternetRequestAccepted]] with the output from [[#Network_Interface_services#GetClientId|GetClientId]] returned false.|-| 0x4AF || 175 || 2 || Bad version returned from calling the "nnjitpluginGetVersion" symbol.|-| 0xCAAF || 175 || 101 || Input NRO/NRR are too large for the storage buffer.|-| 0x4B0AF || 175 || 600 || Symbol funcptr used by this cmd is not initialized (Control/GenerateCode).|-| 0x4B2AF || 175 || 601 || DllPlugin Not initialized, or plugin NRO has already been loaded.|-| 0x4B4AF || 175 || 602 || An error was returned from calling the symbol funcptr with the Control cmd.|-| 0xC8B2 || 178 || 100 || Invalid user ID|-| 0xCAB2 || 178 || 101 || User does not exist|-| 0x12CB2 || 178 || 150 || Service unavailable|-| 0x190B2 || 178 || 200 || File storage failure|-| 0xAB4 || 180 || 5 || Invalid event ID|-| 0x1F4EB5 || 181 || 4007 || Device authentication error: System update required|-| 0x1F50B5 || 181 || 4008 || Device authentication error: [https://en-americas-support.nintendo.com/app/answers/detail/a_id/42061/ Permanant Ban]|-| 0x1F52B5 || 181 || 4009 || Device authentication error: Internal server error|-| 0x1F54B5 || 181 || 4007 || Device authentication error: Under maintenance|-| || 181 || 4017 || Device authentication error: [https://en-americas-support.nintendo.com/app/answers/detail/a_id/43653/ Ban]|-| 0x58ACA || 202 || 709 || Npad ID is out of range.|-| 0x2032CA || 202 || 4121 || [[Settings_services#ButtonConfigSettings|ButtonConfigSettings]] IsFull flag is clear.|-| 0x28CB || 203 || 20 || The [6.0.0+] Authentication challenge failed.|-| 0x40CB || 203 || 32 || Bad State / bad state ptr.|-| 0x82CB || 203 || 65 || Failed to connect to the AccessPoint.|-| 0x84CB || 203 || 66 || Timeout occured during Authentication / while attempting to find a valid ActionFrame.|-| 0x86CB || 203 || 67 || Maximum participants reached, Station not allowed to connect, ...|-| 0xC0CB || 203 || 96 || Bad input, or not initialized.|-| 0xC2CB || 203 || 97 || Matching LocalCommunicationId not found in the user-process [[NACP_Format|control.nacp]].|-| 0xE2CB || 203 || 113 || The specified LocalCommunicationVersion is less than the AccessPoint LocalCommunicationVersion.|-| 0xE4CB || 203 || 114 || The specified LocalCommunicationVersion is larger than the AccessPoint LocalCommunicationVersion.|-| 0xF0CD || 205 || 120 || IR image data not available/ready.|-| 0x1A8CD || 205 || 212 || IR camera handle pointer is null.|-| 0x198CD || 205 || 204 || IR camera invalid handle value.|-| 0x4CE || 206 || 2 || Invalid argument.|-| 0x6CE || 206 || 3 || Out of memory.|-| 0x10CE || 206 || 8 || Out of range. Buffer needs to be aligned.|-| 0x18CE || 206 || 12 || Invalid FileId.|-| 0x1ACE || 206 || 13 || Invalid storage ID.|-| 0x1CCE || 206 || 14 || Invalid content type.|-| 0x2ACE || 206 || 21 || Failed to mount Image Directory.|-| 0x2CCE || 206 || 23 || File too big.|-| 0x30CE || 206 || 24 || Invalid file size.|-| 0x3CCE || 206 || 30 || Buffer insufficient.|-| 0xAF2CE || 206 || 1401 || Too many files already saved.|-| 0x4DA || 218 || 2 || StatusManager entry IsValid flag not set, or controller-update currently in-progress.|-| 0x6DA || 218 || 3 || Controller-update failed via the LibraryApplet.|-| 0x8DA || 218 || 4 || Invalid BusHandle.|-| 0xADA || 218 || 5 || StatusManager entry flag +0x0 not set, or device not connected.|-| 0xEDA || 218 || 7 || PollingReceivedData not available.|-| 0x10DA || 218 || 8 || StatusManager entry DeviceEnabled flag not set, or flag +0x0 not set.|-| 0x12DA || 218 || 9 || ExternalDeviceId mismatch.|-| 0x14DA || 218 || 10 || BusHandle already initialized.|-| 0x104E7 || 231 || 130 || Nullptr passed to the LocalCommunicationId [[NACP_Format|control.nacp]] validation func.|-| 0x140E7 || 231 || 160 || GroupInfo field out of range.|-| 0x142E7 || 231 || 161 || SupportedPlatform not appropriate for this operation.|-| 0x146E7 || 231 || 163 || Invalid ServiceName.|-| 0x148E7 || 231 || 164 || Must provide PresharedBinaryKey.|-| 0x1C0E7 || 231 || 224 || Requested Priority value not allowed.|-| 0x1C2E7 || 231 || 225 || Matching LocalCommunicationId not found in the user-process [[NACP_Format|control.nacp]].|-| 0x200E7 || 231 || 256 || Invalid flag.|-| 0x204E7 || 231 || 258 || Invalid SupportedPlatform.|-| 0x208E7 || 231 || 260 || Invalid StaticAesKeyIndex.|-| 0x20AE7 || 231 || 261 || MemberCountMax cannot be greater than 8.|-| 0x210E7 || 231 || 264 || GroupInfo+8F must be 0x20.|} === FS Error codes ===The following are the error codes recognized by nn::fs::detail::LogErrorMessage found in some [[Factory Setup|factory]] titles: {| class=wikitable! Value || Description || Message|-| 0xD401 || 106 || nn::svc::ResultInvalidCurrentMemory: Error: Passed buffer is not usable for fs library. See a manual of fs library for more information.|-| 0x7802 || 60 || nn::fs::ResultMountNameAlreadyExists: Error: Specified mount name already exists.|-| 0x7D202 || 1001 || nn::fs::ResultPartitionNotFound: Error: Specified partition is not found.|-| 0x7D402 || 1002 || nn::fs::ResultTargetNotFound: Error: Specified target is not found.|-| 0xFA002 - 0x138602 || 2000 - 2499 || nn::fs::ResultSdCardAccessFailed: Error: Failed to access SD card.|-| 0x136802 - 0x176E02 || 2500 - 2999 || nn::fs::ResultGameCardAccessFailed: Error: Failed to access game card.|-| 0x177202 || 3001 || nn::fs::ResultNotImplemented: Error: Specified operation is not implemented.|-| 0x177A02 || 3005 || nn::fs::ResultOutOfRange: Error: Specified value is out of range.|-| 0x190002 - 0x1B5602 || 3200 - 3499 || nn::fs::ResultAllocationMemoryFailed: Error: Failed to allocate memory.|-| 0x1B5802 - 0x1F3E02 || 3500 - 3999 || nn::fs::ResultMmcAccessFailed: Error: Failed to access MMC.|-| 0x1F4202 - 0x219602 || 4001 - 4299 || nn::fs::ResultRomCorrupted: Error: ROM is corrupted.|-| 0x219A02 - 0x232602 || 4301 - 4499 || nn::fs::ResultSaveDataCorrupted: Error: Save data is corrupted.|-| 0x232A02 - 0x23EE02 || 4501 - 4599 || nn::fs::ResultNcaCorrupted: Error: NCA is corrupted.|-| 0x23F202 - 0x243E02 || 4601 - 4639 || nn::fs::ResultIntegrityVerificationStorageCorrupted: Error: Integrity verification failed.|-| 0x244202 - 0x246602 || 4641 - 4659 || nn::fs::ResultPartitionFileSystemCorrupted: Error: Partition FS is corrupted.|-| 0x246A02 - 0x248E02 || 4661 - 4679 || nn::fs::ResultBuiltInStorageCorrupted: Error: Built-in-storage is corrupted.|-| 0x249202 - 0x24B602 || 4681 - 4699 || nn::fs::ResultFatFileSystemCorrupted: Error: FAT FS is corrupted.|-| 0x24BA02 - 0x24DE02 || 4701 - 4719 || nn::fs::ResultHostFileSystemCorrupted: Error: HOST FS is corrupted.|-| 0x1F4002 - 0x270E02 || 4000, 4300, 4500, 4600, 4640, 4660, 4680, 4700, 4720-4999 || nn::fs::ResultDataCorrupted: Error: Data is corrupted.|-| 0x271002 - 0x2EDE02 || 5000-5999 || nn::fs::ResultUnexpected: Error: Unexpected failure occurred.|-| 0x2EE002 - 0x32C602 || 6000-6499 || nn::fs::ResultPreconditionViolation: Error: Precondition violation.|-| 0x2EE202 - 0x306E02 || 6001-6199 || nn::fs::ResultInvalidArgument: Error: Invalid argument was specified.|-| 0x2EE402 - 0x2F1A02 || 6002-6029 || nn::fs::ResultInvalidPath: Error: Invalid path was specified.|-| 0x2EE602 || 6003 || nn::fs::ResultTooLongPath: Error: Too long path was specified.|-| 0x2EE802 || 6004 || nn::fs::ResultInvalidCharacter: Error: Invalid path character was specified.|-| 0x2EEA02 || 6005 || nn::fs::ResultInvalidPathFormat: Error: Invalid path format was specified.|-| 0x2F5A02 || 6061 || nn::fs::ResultInvalidOffset: Error: Invalid offset was specified.|-| 0x2F5C02 || 6062 || nn::fs::ResultInvalidSize: Error: Invalid size was specified.|-| 0x2F5E02 || 6063 || nn::fs::ResultNullptrArgument: Error: Null pointer argument was specified.|-| 0x2F6202 || 6065 || nn::fs::ResultInvalidMountName: Error: Invalid mount name was specified.|-| 0x2F6402 || 6066 || nn::fs::ResultExtensionSizeTooLarge: Error: Extension size exceeds max value set in nmeta file.|-| 0x2F6602 || 6067 || nn::fs::ResultExtensionSizeInvalid: Error: Extension size is not a multiple of nn::fs::SaveDataExtensionUnitSize.|-| 0x307202 || 6201 || nn::fs::ResultFileExtensionWithoutOpenModeAllowAppend: Error: OpenMode_AllowAppend is required for implicit extension of file size by WriteFile().|-| 0x307002 - 0x313602 || 6200, 6202 - 6299 || nn::fs::ResultInvalidOperationForOpenMode: Error: Invalid operation for the open mode.|-| 0x313802 - 0x31FE02 || 6300-6399 || nn::fs::ResultUnsupportedOperation: Error: Unsupported operation.|-| 0x320002 - 0x326202 || 6400-6449 || nn::fs::ResultPermissionDenied: Error: Permission denied.|-| 0x327202 || 6457 || nn::fs::ResultWriteModeFileNotClosed: Error: Close files opened in write mode before committing.|-| 0x328202 || 6465 || nn::fs::ResultUserNotExist: Error: Specified user doesn't exist.|-| 0x346402 || 6706 || nn::fs::ResultMappingTableFull: Error: Enough journal space is not left.|-| 0x346A02 || 6709 || nn::fs::ResultOpenCountLimit: Error: The open count of files and directories reached the limitation.|-| 0x353602 || 6811 || nn::fs::ResultMapFull: Error: Save data extension count reached the limitation.|-| 0x35F202 || 6905 || nn::fs::ResultNotMounted: Error: Specified mount name is not found.|} = Fatal Errors ={| class=wikitable! Error || Description|-| 2162-0002| Can be triggered by running [[SVC|svcBreak]]. The svcBreak params have no effect on the value of the thrown error-code.|-| 2168-0000| Userland ARM undefined instruction exception|-| 2168-0001| Userland ARM prefetch-abort due to PC set to non-executable region|-| 2168-0002| Userland ARM data abort. Also caused by abnormal process termination via [[SVC|svcExitProcess]]. Note: directly jumping to nnMain()-retaddr from non-main-thread has the same result.|-| 2168-0003| Userland PC address not aligned to 4 bytes|-| 2168-0008| Can occur when attempting to call an svc outside the whitelist|} = Support Errors =This section is for Support Errors displayed by the error-applet, separate from the normal Result Errors. == Modules =={| class=wikitable! Value || Name|-| 520 || Nverpt|-| 600 || |-| 601 || |-| 602 || |-| 603 || |-| 604 || |-| 605 || |-| 606 || |-| 607 || |-| 608 || |-| 609 || |-| 610 || |-| 611 || |-| 612 || |-| 613 || |-| 614 || |-| 615 || |-| 616 || |-| 617 || |-| 618 || |-| 619 || |-| 620 || |-| 621 || |-| 622 || |-| 623 || |-| 800 || [[Internet_Browser|General web-applet]]|-| 801 || |-| 802 || |-| 803 || |-| 804 || |-| 805 || |-| 806 || |-| 807 || |-| 808 || |-| 809 || [[Internet_Browser|WifiWebAuthApplet]]|-| 810 || [[Internet_Browser|Whitelisted-applet]]
|-
| 811 || [[Internet_Browser|ShopN]]
|-
| 812 ||
|-
| 813 ||
|-
| 814 ||
|-
| 815 ||
|-
| 816 ||
|-
| 817 ||
|-
| 818 ||
|-
| 819 ||
|-
| 820 ||
|-
| 821 ||
|-
| 899 ||
|-
| 999 ||
|}
! Value || Module || Description || Notes
|-
| Variable
| {web-applets listed above}
| 2750